{"text_format":"1","workbook":"xlsx","n_sheets":13,"sheets":["BOISSON","CLUB","DONNEES","FICHE-JOUEUR","Saisie des joueurs","BILLARD 1","BILLARD 2","BILLARD 3","BILLARD 4","BILLARD 5","BILLARD 6","Distances","Heures convocations"],"not_rendered":{"charts":0,"images":4,"macros":1,"external_links":0,"defined_names":6,"comments":0,"pivot_tables":0},"unopened":[],"bounds":{"document_bytes":16777216,"sheet_cells":100000,"rows_first":2000,"rows_last":500,"rows_between":2000,"halvings":0,"cell_chars":16384,"cell_head_chars":4096},"cells_cut":0,"cells_raw":0,"read":"whole","date_system":"1900"}

{"sheet":"BOISSON","index":0,"n_rows":26,"n_cols":6,"rows_kept":26,"cut":false,"hidden":false,"merged":[[0,0,0,5]]}
["BILLARD CLUB"]
["Nom - Prénom","EAU","BOISSONS","REPAS","TOTAL","CLUB"]
[{"$f":"'Saisie des joueurs'!B18","v":0}]
[{"$f":"'Saisie des joueurs'!B19","v":0}]
[{"$f":"'Saisie des joueurs'!B20","v":0}]
[{"$f":"'Saisie des joueurs'!B21","v":0}]
[{"$f":"'Saisie des joueurs'!B22","v":0}]
[{"$f":"'Saisie des joueurs'!B23","v":0}]
[{"$f":"'Saisie des joueurs'!B24","v":0}]
[{"$f":"'Saisie des joueurs'!B25","v":0}]
[{"$f":"'Saisie des joueurs'!B26","v":0}]
[{"$f":"'Saisie des joueurs'!B27","v":0}]
[{"$f":"'Saisie des joueurs'!B28","v":0}]
[{"$f":"'Saisie des joueurs'!B29","v":0}]
[{"$f":"'Saisie des joueurs'!B30","v":0}]
[{"$f":"'Saisie des joueurs'!B31","v":0}]
[{"$f":"'Saisie des joueurs'!B32","v":0}]
[{"$f":"'Saisie des joueurs'!B33","v":0}]
[{"$f":"'Saisie des joueurs'!B34","v":0}]
[{"$f":"'Saisie des joueurs'!B35","v":0}]
[{"$f":"'Saisie des joueurs'!B36","v":0}]
[{"$f":"'Saisie des joueurs'!B37","v":0}]
[{"$f":"'Saisie des joueurs'!B38","v":0}]
[{"$f":"'Saisie des joueurs'!B39","v":0}]
[{"$f":"'Saisie des joueurs'!B40","v":0}]
[{"$f":"'Saisie des joueurs'!B41","v":0}]

{"sheet":"CLUB","index":1,"n_rows":27,"n_cols":5,"rows_kept":27,"cut":false,"hidden":true,"merged":[[0,0,0,4]]}
["CLUB AFFILIE LMB\n"]
["CLUB","ADRESSE 1","ADRESSE 2","CODE POSTAL","VILLE"]
["ACADEMIE BILLARD ST RAPHAEL","PROMENADE RENE COTY",null,83700,"ST RAPHAEL"]
["ACADEMIE DE BILLARD DE BOLLENE","GROUPE SCOLAIRE PIERRE MARIE CURIE",null,84500,"BOLLENE"]
["ACADEMIE DE BILLARD DE MENTON","Académie municipale de billard","Allée du Louvre Salon du Louvre",6500,"MENTON"]
["BILLARD CLUB  AIX EN PROVENCE","RUE PIERRE DE COUBERTIN",null,13100,"AIX EN PROVENCE"]
["BILLARD CLUB AMATEUR ROGNAC","60 BOULEVARD JEAN JAURES",null,13340,"ROGNAC"]
["BILLARD CLUB AVIGNONNAIS","12 RUE BONAPARTE","MAISON DU COMBATTANT",84000,"AVIGNON"]
["BILLARD CLUB BERROIS","RUE MARCEL PAGNOL",null,13130,"BERRE L ETANG"]
["BILLARD CLUB CARPENTRASSIEN","264 BOULEVARD ALBIN DURAND",null,84200,"CARPENTRAS"]
["BILLARD CLUB CAVAILLONNAIS","CERCLE DE L INDEPENDANCE","97 COURS VICTOR HUGO",84300,"CAVAILLON"]
["BILLARD CLUB CLUB ARLESIEN","1 RUE HONORE CLAIR",null,13200,"ARLES"]
["BILLARD CLUB DE LA BAIE CAVALAIRE","SALLE OTTAVI","AVENUE DES ALLIES",83240,"CAVALAIRE SUR MER"]
["BILLARD CLUB DE MANDELIEU LA NAPOULE","Centre Culturel","29 Place de la Liberté",6210,"MANDELIEU LA NAPOULE"]
["BILLARD CLUB DE NICE","SALLE MALATESTA","64 AVENUE CYRILLE BESSET",6100,"NICE"]
["BILLARD CLUB LA FARE LES OLIVIERS","36 BIS AVENUE PASTEUR",null,13580,"LA FARE LES OLIVIERS"]
["BILLARD CLUB LA GARDE","LE MAS QUARTIER SAINTE MARGUERITE","293 AVENUE PIERRE LOTI",83130,"LA GARDE"]
["BILLARD CLUB ORANGE","ACADEMIE DE BILLARD","67 COURS POURTOULES",84100,"ORANGE"]
["BILLARD CLUB ORANGE","MAISON DES ASSOCIATIONS","ROUTE DE CADEROUSSE",84100,"ORANGE"]
["BILLARD CLUB PHOCEEN","12 rue du docteur ACQUAVIVA",null,13004,"MARSEILLE"]
["BILLARD CLUB ROQUEBRUNOIS","44 avenue Gabriel Péri",null,83520,"ROQUEBRUNE SUR ARGENS"]
["BILLARD CLUB SALON","CERCLE DES ARTS","RUE DES FILEUSES DE SOIE",13300,"SALON DE PROVENCE"]
["BILLARD CLUB SAUSSET LES PINS","PARC MUNICIPAL DES LOISIRS","31 AVENUE DE LA COTE BLEUE",13960,"SAUSSET LES PINS"]
["BILLARD CLUB SISTERONNAIS","73 AVENUE DE LA DURANCE","SALLE OMNISPORT DANIEL MAFFREN",4200,"SISTERON"]
["BILLARD CLUB VINON SUR VERDON","480 RUE DES ENTREPRENEURS","ZA DU PAS DE MENC",83560,"VINON SUR VERDON"]
["CLUB BILLARD ISTRES","HALLE POLYVALENTE PLACE RAOUX","ALLEE DES ECHOPPES",13800,"ISTRES"]
["SPORT AMAT.DE BILLARD MARSEILLAIS","26 RUE PAVILLON",null,13001,"MARSEILLE"]

{"sheet":"DONNEES","index":2,"n_rows":435,"n_cols":6,"rows_kept":435,"cut":false,"hidden":false,"merged":[[0,0,0,5]]}
["Classification  L.M.B   LIBRE\n 2022 - 2023"]
[]
["NC-CL","NOM","LICENCE","CAT","MG","CLUB"]
[null,"ABOUT RENE","132348 I","R4",0.56999999999999995,"19056 – BILLARD CLUB DE NICE"]
[null,"ABSENT",0,"XX",0,"XXXXXXX"]
[null,"ADAM EDDY","118650 M","R2",2.6,"19106 – BILLARD CLUB VINONNAIS"]
["NC","AKNIN GABRIEL","021810 W","N3",6,"19027 – ACADEMIE DE BILLARD DE BOLLENE"]
[null,"ALESSI JEAN PIERRE","149448 T","R3",1.1200000000000001,"19023 – BILLARD CLUB GARDEEN"]
[null,"ALIBERT BRUNO","151459 E","R2",1.79,"19056 – BILLARD CLUB DE NICE"]
[null,"ALLIGIER GERARD","157036 R","R3",1.35,"19019 – BILLARD CLUB DE LA BAIE"]
[null,"ALVAREZ PHILIPPE","159130 S","R2",1.43,"19056 – BILLARD CLUB DE NICE"]
[null,"ALVISET GUY","152035 F","R3",1.06,"19050 – BILLARD CLUB SAUSSETOIS"]
[null,"AMOUROUX LUC","155531 F","R4",0.75,"19023 – BILLARD CLUB GARDEEN"]
[null,"ANDRY JEAN FRANCOIS","021818 E","R2",1.82,"19090 – BILLARD AMATEUR ROGNAC"]
[null,"ANNESTAY JACQUES","021820 G","R2",1.7,"19025 – BILLARD CLUB SISTERONNAIS"]
[null,"ANTONIN ALAIN","021821 H","N3",8.4499999999999993,"19021 – BILLARD CLUB CAVAILLONNAIS"]
[null,"ARMAND ANTHONY","134389 V","R4",0.8,"19106 – BILLARD CLUB VINONNAIS"]
["CL","ARMENGAU PHILIPPE","161785 D","R4",0.63,"19056 – BILLARD CLUB DE NICE"]
[null,"ARNOUX THIERRY","133645 F","R3",1.6,"19106 – BILLARD CLUB VINONNAIS"]
[null,"ARPIN GILBERT","021829 P","R2",2.27,"19014 – BILLARD CLUB AVIGNONNAIS"]
[null,"ATHLANI MICHEL","166320 H","R3",1,"19002 – SPORT AMAT.DE BILLARD MARSEILLAIS"]
[null,"AUBERT ROUECHE ERIC","022383 X","N3",6.57,"19106 – BILLARD CLUB VINONNAIS"]
[null,"AUBERT ROUECHE LYDIA","148204 R","R3",1.54,"19106 – BILLARD CLUB VINONNAIS"]
[null,"AUDIBERT JEAN PIERRE","106513 R","R2",2.4,"19012 – SALON BILLARD CLUB"]
[null,"AUDOUIN JEAN JACQUES","138454 E","R3",1.1399999999999999,"19050 – BILLARD CLUB SAUSSETOIS"]
[null,"BAILLON JEAN","115304 U","R3",1.1499999999999999,"19058 – ACADEMIE DE BILLARD DE BARBOSSI MANDELIEU"]
[null,"BAILLY FRANCIS","136073 P","R1",3.26,"19001 – S. S. A. B. D AIX EN PROVENCE"]
[null,"BALESTRI CHARLY","150101 D","R2",3.13,"19058 – ACADEMIE DE BILLARD DE BARBOSSI MANDELIEU"]
[null,"BALESTRI MAURICE","153554 G","R4",0.83,"19058 – ACADEMIE DE BILLARD DE BARBOSSI MANDELIEU"]
[null,"BALLIGAND SERGE","023184 S","R1",4.04,"19059 – BILLARD CLUB ROQUEBRUNOIS"]
[null,"BANO SERGE","149693 K","R3",1.08,"19001 – S. S. A. B. D AIX EN PROVENCE"]
[null,"BARBANNEAU FREDERIC","109917 P","R1",2,"19012 – SALON BILLARD CLUB"]
[null,"BARDET JEAN PIERRE","018535 X","R1",2.8,"19023 – BILLARD CLUB GARDEEN"]
[null,"BARRALLON JEAN PAUL","122300 W","R3",1.56,"19023 – BILLARD CLUB GARDEEN"]
[null,"BARTOLETTI JULIEN","115343 H","R1",3.02,"19017 – BILLARD CLUB PHOCEEN"]
[null,"BASSIGNANA ROBERT","129911 P","R3",1.31,"19023 – BILLARD CLUB GARDEEN"]
[null,"BASSOUL JEAN MARIE","103568 K","R2",2.17,"19006 – BILLARD CLUB CARPENTRASSIEN"]
[null,"BAUDOIN MICHEL","119264 C","R4",0.92,"19059 – BILLARD CLUB ROQUEBRUNOIS"]
[null,"BAYARD JEAN CLAUDE","021860 U","R3",0.88,"19021 – BILLARD CLUB CAVAILLONNAIS"]
[null,"BEDOC JACQUES","021863 X","R2",2.21,"19007 – BILLARD CLUB BERROIS"]
[null,"BELTRITTI JEAN YVES","132789 H","R3",1.22,"19106 – BILLARD CLUB VINONNAIS"]
[null,"BENAVIDES CLAUDE","021872 G","R2",3.06,"19012 – SALON BILLARD CLUB"]
[null,"BENIER PATRICK","159238 K","R4",0.84,"19023 – BILLARD CLUB GARDEEN"]
[null,"BENOIT MICHEL","159790 K","R4",0.81,"19027 – ACADEMIE DE BILLARD DE BOLLENE"]
[null,"BERNAT JEAN PIERRE","125945 B","R3",1.43,"19023 – BILLARD CLUB GARDEEN"]
[null,"BERTRAND CADI YVES","021884 S","R3",1.08,"19016 – BILLARD CLUB ORANGEOIS"]
[null,"BETTES CECILE","016451 T","R3",1.5,"19012 – SALON BILLARD CLUB"]
[null,"BIARD ANDRE","159202 W","R4",0.52,"19009 – CLUB BILLARD ISTREEN"]
[null,"BIDDAU FRANCOIS","125917 Z","R2",2.2999999999999998,"19009 – CLUB BILLARD ISTREEN"]
[null,"BIETTI ALEXIS","135560 W","R4",0.46,"19119 – AMICALE SNOOKER DE FREJUS"]
[null,"BILDIK MEHMET","141828 Y","N3",5.61,"19006 – BILLARD CLUB CARPENTRASSIEN"]
[null,"BLERVACQUE ALAIN","136075 R","R3",0.99,"19106 – BILLARD CLUB VINONNAIS"]
[null,"BOFFA BERNARD","016248 Y","R3",1.1499999999999999,"19023 – BILLARD CLUB GARDEEN"]
[null,"BONALD YVES","132947 J","N3",6.31,"19001 – S. S. A. B. D AIX EN PROVENCE"]
[null,"BONELLO LUCIEN","021894 C","R3",1.01,"19090 – BILLARD AMATEUR ROGNAC"]
[null,"BONNEMAISON DENIS","150422 C","R4",0.8,"19009 – CLUB BILLARD ISTREEN"]
[null,"BONTEMPS PIERRE","021899 H","R3",1.22,"19058 – ACADEMIE DE BILLARD DE BARBOSSI MANDELIEU"]
[null,"BONTOUX MAX","021900 I","R1",3.21,"19090 – BILLARD AMATEUR ROGNAC"]
[null,"BORDES BERNARD","149287 T","R1",4.66,"19061 – ACAD.BILLARD ST RAPHAEL"]
[null,"BORDES CATHERINE","149288 V","R4",0.51,"19061 – ACAD.BILLARD ST RAPHAEL"]
[null,"BOSSOT JEAN","160000 N","R2",1.6,"19027 – ACADEMIE DE BILLARD DE BOLLENE"]
[null,"BOULANDET ALAIN","012645 J","R3",1.44,"19055 – ACADEMIE DE BILLARD DE MENTON"]
[null,"BOULANT CLAUDE","155529 D","R2",2.13,"19019 – BILLARD CLUB DE LA BAIE"]
[null,"BOVET MICHEL","149613 Y","R3",0.93,"19059 – BILLARD CLUB ROQUEBRUNOIS"]
[null,"BRAYER DENIS","016411 F","N3",4.87,"19008 – BRITISH BILLARD CLUB AVIGNON"]
[null,"BREDAT RENE","021918 A","N3",3.29,"19025 – BILLARD CLUB SISTERONNAIS"]
[null,"BREUGGHE JEAN","114355 H","R4",0.65,"19006 – BILLARD CLUB CARPENTRASSIEN"]
[null,"BRIAND ALAIN","113104 E","R1",1.8,"19002 – SPORT AMAT.DE BILLARD MARSEILLAIS"]
[null,"BRIOIT DOMINIQUE","021920 C","R2",2.31,"19055 – ACADEMIE DE BILLARD DE MENTON"]
[null,"BRIOSNE PASCAL","021922 E","R1",3.23,"19001 – S. S. A. B. D AIX EN PROVENCE"]
[null,"BRIQUET ERIC","106514 S","R4",0.85,"19012 – SALON BILLARD CLUB"]
[null,"BRUANT SYLVAIN","114733 V","R2",1.77,"19016 – BILLARD CLUB ORANGEOIS"]
["CL","BURGANT JEAN MARIE","123684 C","R2",2.95,"19061 – ACAD.BILLARD ST RAPHAEL"]
[null,"CACHO DIDIER","112311 R","R1",3.6,"19098 – BILLARD CLUB LA FARE"]
[null,"CALDERON LUC","021938 U","R2",3,"19009 – CLUB BILLARD ISTREEN"]
["CL","CALDERON MATHYS","173674 B","R4",0.5,"19009 – CLUB BILLARD ISTREEN"]
[null,"CAO HUU TUOI","021944 A","R1",4.45,"19012 – SALON BILLARD CLUB"]
[null,"CARRARA FELIX","148607 E","R4",0.74,"19058 – ACADEMIE DE BILLARD DE BARBOSSI MANDELIEU"]
[null,"CARRE PIERRE","152346 T","R4",0.82,"19058 – ACADEMIE DE BILLARD DE BARBOSSI MANDELIEU"]
[null,"CARRION JEAN PHILIPPE","130701 Z","R1",3.41,"19057 – ACADEMIE VENCOISE DE BILLARD"]
[null,"CASTA HELENE","021952 I","R4",0.8,"19025 – BILLARD CLUB SISTERONNAIS"]
[null,"CASTA JEAN","021953 J","R2",2.29,"19025 – BILLARD CLUB SISTERONNAIS"]
[null,"CESARINI JEAN PAUL","112516 O","N3",3.9,"19106 – BILLARD CLUB VINONNAIS"]
[null,"CESARO JEAN CLAUDE","118684 U","R3",1.1200000000000001,"19007 – BILLARD CLUB BERROIS"]
[null,"CHABASSIERE DOMINIQUE","173622 V","R2",2.31,"19098 – BILLARD CLUB LA FARE"]
[null,"CHABOUD JACQUES","161620 Z","R4",0.49,"19023 – BILLARD CLUB GARDEEN"]
[null,"CHADELAT BERNARD","114501 X","R3",1.61,"19106 – BILLARD CLUB VINONNAIS"]
[null,"CHAPUIS ERIC","104469 B","N1",11.41,"19056 – BILLARD CLUB DE NICE"]
[null,"CHARBAUT CLAUDE","122456 W","R3",1.1200000000000001,"19059 – BILLARD CLUB ROQUEBRUNOIS"]
[null,"CHARBIT JEAN MARC","021967 X","R2",2.79,"19056 – BILLARD CLUB DE NICE"]
[null,"CHARLOT ALLAN","021969 Z","N3",8.43,"19027 – ACADEMIE DE BILLARD DE BOLLENE"]
[null,"CHARTIER YVES","021971 B","R3",1.29,"19090 – BILLARD AMATEUR ROGNAC"]
[null,"CHASTAN GEORGES","012782 Q","R2",2.19,"19021 – BILLARD CLUB CAVAILLONNAIS"]
[null,"CHAUVIN JEAN PAUL","021972 C","R2",1.98,"19050 – BILLARD CLUB SAUSSETOIS"]
[null,"CHESNAIS CHRISTOPHE","012793 B","R1",4.6399999999999997,"19055 – ACADEMIE DE BILLARD DE MENTON"]
[null,"CHICARD ALAIN","160332 Z","R4",0.73,"19006 – BILLARD CLUB CARPENTRASSIEN"]
[null,"CHUZEVILLE GILLES","108854 S","R2",2.1800000000000002,"19025 – BILLARD CLUB SISTERONNAIS"]
[null,"CLAICHE GERARD","120275 Z","R4",0.86,"19019 – BILLARD CLUB DE LA BAIE"]
[null,"CLAUDON PHILIPPE","148126 G","R4",0.6,"19056 – BILLARD CLUB DE NICE"]
[null,"CLEMENT GERARD","129497 R","R4",0.84,"19050 – BILLARD CLUB SAUSSETOIS"]
[null,"CLUZEL JEAN LOUP","129909 N","R4",0.69,"19023 – BILLARD CLUB GARDEEN"]
[null,"COATMEUR ALAN","149116 H","R4",0.8,"19014 – BILLARD CLUB AVIGNONNAIS"]
[null,"COHEN RICHARD (Nice)","148796 K","R3",1.35,"19056 – BILLARD CLUB DE NICE"]
["CL","COLIN PHILIPPE","177991 T","R4",0.6,"19106 – BILLARD CLUB VINONNAIS"]
[null,"COLLEMINE BERNARD","113219 P","R2",1.64,"19050 – BILLARD CLUB SAUSSETOIS"]
[null,"CONSOLIN DANIEL","127970 Y","R2",2.16,"19007 – BILLARD CLUB BERROIS"]
[null,"COPPIN JEAN MICHEL","021985 P","R3",1.1200000000000001,"19027 – ACADEMIE DE BILLARD DE BOLLENE"]
[null,"CORDONNIER ROGER","106512 Q","R2",1.63,"19027 – ACADEMIE DE BILLARD DE BOLLENE"]
[null,"CORNIOU JEAN CLAUDE","012844 A","R3",1.25,"19025 – BILLARD CLUB SISTERONNAIS"]
[null,"COSTAZ ALAIN","148136 S","R4",0.62,"19019 – BILLARD CLUB DE LA BAIE"]
[null,"COSTE PHILIPPE","125938 U","R3",1.33,"19061 – ACAD.BILLARD ST RAPHAEL"]
[null,"COUPE GILBERT","120419 N","R2",2.38,"19017 – BILLARD CLUB PHOCEEN"]
[null,"CREUGNY LAURENT","016445 N","R1",3.4,"19027 – ACADEMIE DE BILLARD DE BOLLENE"]
[null,"CROUZET JEAN ANDRE","152067 Q","R3",1.36,"19027 – ACADEMIE DE BILLARD DE BOLLENE"]
[null,"D ANTONIO JEROME","144718 C","R2",2.42,"19014 – BILLARD CLUB AVIGNONNAIS"]
[null,"D HERET ERIC","119971 H","R2",2.16,"19006 – BILLARD CLUB CARPENTRASSIEN"]
[null,"DAMON GERARD","022002 G","R3",1.06,"19056 – BILLARD CLUB DE NICE"]
["CL","DAREAU GERALD","170095 L","R3",1.18,"19055 – ACADEMIE DE BILLARD DE MENTON"]
[null,"DAVID THIERRY","155526 A","R2",1.92,"19025 – BILLARD CLUB SISTERONNAIS"]
["NC","DE BROWER PAUL","177656 E","R4",0.7,"19019 – BILLARD CLUB DE LA BAIE"]
["NC","DE CAMBOURG HELION","171181 R","R3",1.4,"19014 – BILLARD CLUB AVIGNONNAIS"]
[null,"DE HAAN PATRICK","140113 Z","R2",2.2400000000000002,"19061 – ACAD.BILLARD ST RAPHAEL"]
[null,"DE LOOSE FELIX","163348 C","R2",2.25,"19004 – JFP BILLARD DE VIDAUBAN"]
[null,"DECARPENTRIE FREDDY","138297 D","R3",1.65,"19050 – BILLARD CLUB SAUSSETOIS"]
[null,"DEFFE MICHEL","119889 D","R3",1.39,"19068 – BILLARD CLUB ARLESIEN"]
[null,"DEFRESNE JEAN","022012 Q","R3",0.96,"19059 – BILLARD CLUB ROQUEBRUNOIS"]
[null,"DEFRETIN JOEL","020635 R","N1",20.69,"19023 – BILLARD CLUB GARDEEN"]
[null,"DEL MEDICO JEAN","016772 C","R3",1.38,"19061 – ACAD.BILLARD ST RAPHAEL"]
[null,"DELAGE JEAN MARIE","022013 R","R2",1.87,"19056 – BILLARD CLUB DE NICE"]
[null,"DELAIRE SYLVAIN","152184 S","R3",1.05,"19012 – SALON BILLARD CLUB"]
[null,"DELATTRE RAYMOND","022014 S","R3",1.47,"19090 – BILLARD AMATEUR ROGNAC"]
[null,"DELMER PHILIPPE","149695 M","R4",0.74,"19006 – BILLARD CLUB CARPENTRASSIEN"]
[null,"DELUC BERNARD","166346 L","R3",1.05,"19098 – BILLARD CLUB LA FARE"]
[null,"DEMANET CLAUDE","020524 K","R2",2.57,"19057 – ACADEMIE VENCOISE DE BILLARD"]
[null,"DEMANGE DANIEL","149070 H","R4",0.59,"19058 – ACADEMIE DE BILLARD DE BARBOSSI MANDELIEU"]
["NC","DEMARCQ JEAN FRANCOIS","168662 D","R3",1.4,"19025 – BILLARD CLUB SISTERONNAIS"]
[null,"DEMERLIAC BRUNO","159076 J","R4",0.61,"19007 – BILLARD CLUB BERROIS"]
[null,"DEMESSE SERGE","022021 Z","R2",1.87,"19090 – BILLARD AMATEUR ROGNAC"]
[null,"DEMONCEAU BENOIT","012943 V","R4",0.92,"19055 – ACADEMIE DE BILLARD DE MENTON"]
[null,"DESLOIRES MICHEL","022027 F","R3",1.43,"19106 – BILLARD CLUB VINONNAIS"]
[null,"DESMERO RAYMOND","142358 I","R3",1.01,"19007 – BILLARD CLUB BERROIS"]
[null,"DESPLANQUE FRANCIS","022028 G","R2",2.12,"19023 – BILLARD CLUB GARDEEN"]
[null,"DI CINTIO PHILIPPE","144569 J","R2",1.65,"19014 – BILLARD CLUB AVIGNONNAIS"]
[null,"DONABEDIAN DANIEL","142363 N","R3",1.24,"19058 – ACADEMIE DE BILLARD DE BARBOSSI MANDELIEU"]
[null,"DORNEL GERARD","013003 D","R3",1.32,"19061 – ACAD.BILLARD ST RAPHAEL"]
[null,"DOS SANTOS FRANCIS","022039 R","R1",3.04,"19050 – BILLARD CLUB SAUSSETOIS"]
[null,"DOYEN DENIS","143143 N","R3",1.08,"19058 – ACADEMIE DE BILLARD DE BARBOSSI MANDELIEU"]
[null,"DREMEAUX JEAN PIERRE","140803 N","N3",7.93,"19023 – BILLARD CLUB GARDEEN"]
[null,"DRUINOT DOMINIQUE","022042 U","R2",1.78,"19050 – BILLARD CLUB SAUSSETOIS"]
[null,"DUBOC CLAUDE","109448 O","R2",2.5499999999999998,"19023 – BILLARD CLUB GARDEEN"]
[null,"DUBREUIL FRANCK","013022 W","N3",2.5,"19061 – ACAD.BILLARD ST RAPHAEL"]
[null,"DUCA ALFONSO","154651 Z","R4",0.42,"19098 – BILLARD CLUB LA FARE"]
[null,"DUFLOT ALAIN","138116 E","R4",0.78,"19023 – BILLARD CLUB GARDEEN"]
[null,"DUMET BRUNO","013037 L","N3",5.73,"19023 – BILLARD CLUB GARDEEN"]
[null,"DUPERRAY ALEX","147554 K","R4",0.68,"19016 – BILLARD CLUB ORANGEOIS"]
[null,"DURAND FREDERIC","022049 B","R3",1.66,"19012 – SALON BILLARD CLUB"]
[null,"DURAND HERVE","022050 C","N1",10.37,"19012 – SALON BILLARD CLUB"]
[null,"DUSFOUR RENE","022052 E","R3",1.39,"19012 – SALON BILLARD CLUB"]
[null,"DUSSAULE PIERRE","102285 B","R2",1.66,"19027 – ACADEMIE DE BILLARD DE BOLLENE"]
[null,"ELEOUET DANIEL","163467 G","R3",1.45,"19006 – BILLARD CLUB CARPENTRASSIEN"]
[null,"ESTABLIER PIERRE","147622 J","R4",0.57999999999999996,"19023 – BILLARD CLUB GARDEEN"]
[null,"ESTRUGO HENRI","117567 V","R4",0.52,"19012 – SALON BILLARD CLUB"]
[null,"FAGET FRANCIS","101511 H","R2",2.09,"19001 – S. S. A. B. D AIX EN PROVENCE"]
[null,"FARINET JEAN FRANCOIS","145515 T","R3",1.02,"19027 – ACADEMIE DE BILLARD DE BOLLENE"]
[null,"FAURE EMILE","022065 R","R3",1.5,"19016 – BILLARD CLUB ORANGEOIS"]
[null,"FAVARIO CHRISTIAN","022066 S","R3",1.1000000000000001,"19027 – ACADEMIE DE BILLARD DE BOLLENE"]
[null,"FERAUD GERARD","022067 T","N3",7.5,"19027 – ACADEMIE DE BILLARD DE BOLLENE"]
[null,"FERHAT ACHOUR","129036 Y","N3",8.57,"19106 – BILLARD CLUB VINONNAIS"]
[null,"FERNANDES VINCENT","022071 X","R2",2.78,"19061 – ACAD.BILLARD ST RAPHAEL"]
[null,"FERNANDEZ MARC","013111 H","N3",4.24,"19007 – BILLARD CLUB BERROIS"]
[null,"FERRO PHILIPPE","122658 Q","R3",1.56,"19009 – CLUB BILLARD ISTREEN"]
["NC","FLEURIOT PATRICK","173138 T","R4",0.4,"19014 – BILLARD CLUB AVIGNONNAIS"]
[null,"FONTAINE DANY","101139 Z","N3",8.2899999999999991,"19059 – BILLARD CLUB ROQUEBRUNOIS"]
[null,"FORGET LIONEL","152014 H","R3",0.85,"19007 – BILLARD CLUB BERROIS"]
[null,"FOSSATI BRUNO","022082 I","R3",1.36,"19023 – BILLARD CLUB GARDEEN"]
[null,"FRANCO GILBERT","022084 K","R2",2.1,"19019 – BILLARD CLUB DE LA BAIE"]
[null,"FRELON THIERRY","125666 I","R3",1.24,"19016 – BILLARD CLUB ORANGEOIS"]
[null,"FROMEYER CORINNE","167290 M","R4",0.55000000000000004,"19058 – ACADEMIE DE BILLARD DE BARBOSSI MANDELIEU"]
[null,"FURNON ROGER","159060 R","R4",0.9,"19014 – BILLARD CLUB AVIGNONNAIS"]
[null,"GABETTO STEPHANE","103216 W","R2",1.61,"19023 – BILLARD CLUB GARDEEN"]
[null,"GALARDINI RICHARD","142316 S","R3",1.1000000000000001,"19050 – BILLARD CLUB SAUSSETOIS"]
[null,"GANTOIS GILLES","022092 S","N3",6.83,"19016 – BILLARD CLUB ORANGEOIS"]
[null,"GANTOIS NADINE","122653 L","R4",0.88,"19027 – ACADEMIE DE BILLARD DE BOLLENE"]
[null,"GATTO ANTOINE","022097 X","R3",1.1200000000000001,"19050 – BILLARD CLUB SAUSSETOIS"]
[null,"GAUCHER JULIEN","112833 T","R1",4.57,"19004 – JFP BILLARD DE VIDAUBAN"]
[null,"GAVALDA PIERRE","116278 G","R2",2.78,"19006 – BILLARD CLUB CARPENTRASSIEN"]
[null,"GAVANON ANDRE","125944 A","R2",0,"19023 – BILLARD CLUB GARDEEN"]
[null,"GELAS BERNARD","163279 C","R3",0.99,"19098 – BILLARD CLUB LA FARE"]
[null,"GEORGE ALAIN","022101 B","R2",2.46,"19057 – ACADEMIE VENCOISE DE BILLARD"]
[null,"GERARD PASCAL","022103 D","N1",17.68,"19056 – BILLARD CLUB DE NICE"]
[null,"GERVAIS GUILLAUME","022104 E","N1",8.36,"19021 – BILLARD CLUB CAVAILLONNAIS"]
[null,"GHU GERARD","101282 M","R2",2.13,"19016 – BILLARD CLUB ORANGEOIS"]
[null,"GIANNATTASIO LUCIEN","022108 I","R2",1.78,"19009 – CLUB BILLARD ISTREEN"]
[null,"GIBARROUX CHRISTOPHE","118661 X","N3",4.08,"19001 – S. S. A. B. D AIX EN PROVENCE"]
[null,"GIFFARD PHILIPPE","149390 F","N3",5.01,"19023 – BILLARD CLUB GARDEEN"]
[null,"GIOVANNETTI DAMIEN","022115 P","R3",1.46,"19050 – BILLARD CLUB SAUSSETOIS"]
[null,"GIRARD JACQUES","129718 E","R3",1.4,"19058 – ACADEMIE DE BILLARD DE BARBOSSI MANDELIEU"]
[null,"GODAERT BERNARD","119705 B","R4",0.92,"19050 – BILLARD CLUB SAUSSETOIS"]
[null,"GODARD PASCAL","157852 D","R2",2.74,"19006 – BILLARD CLUB CARPENTRASSIEN"]
[null,"GOMES VITOR","120100 G","R2",2.61,"19001 – S. S. A. B. D AIX EN PROVENCE"]
[null,"GOMEZ TONY","135012 U","R3",1.35,"19061 – ACAD.BILLARD ST RAPHAEL"]
[null,"GOUALOU LAURENT","022126 A","R3",0.96,"19056 – BILLARD CLUB DE NICE"]
[null,"GOUDENECHE BERNARD","131925 B","R3",0.95,"19098 – BILLARD CLUB LA FARE"]
[null,"GOUIRAN GEORGES","022129 D","R3",1.27,"19050 – BILLARD CLUB SAUSSETOIS"]
[null,"GOURSEAUD YVES","104054 C","N3",5.92,"19016 – BILLARD CLUB ORANGEOIS"]
[null,"GRAVELLE JULIEN","157851 C","R4",0.81,"19006 – BILLARD CLUB CARPENTRASSIEN"]
[null,"GREGOIRE J CLAUDE","149576 H","R4",0.75,"19016 – BILLARD CLUB ORANGEOIS"]
[null,"GUERI ROBERT","135013 V","R3",1.25,"19027 – ACADEMIE DE BILLARD DE BOLLENE"]
[null,"GUERINEAU THIERRY","022135 J","N3",4.51,"19021 – BILLARD CLUB CAVAILLONNAIS"]
[null,"GUEUG PIERRE","104475 H","R2",1.45,"19056 – BILLARD CLUB DE NICE"]
[null,"GUEZOU MATHIS","151649 L","R4",0.48,"19012 – SALON BILLARD CLUB"]
[null,"GUIBERT JEAN MARIE","022137 L","R2",1.41,"19009 – CLUB BILLARD ISTREEN"]
["CL","GUIZELIN PASCAL","154530 S","R3",1.1200000000000001,"19106 – BILLARD CLUB VINONNAIS"]
[null,"GUSTIN ANDRE","109915 N","R4",0.75,"19009 – CLUB BILLARD ISTREEN"]
[null,"GUTIERREZ FRANCOIS","022138 M","R3",1.04,"19002 – SPORT AMAT.DE BILLARD MARSEILLAIS"]
[null,"HAHN DANIEL","011966 G","R3",1.46,"19017 – BILLARD CLUB PHOCEEN"]
[null,"HAROUTUNIAN PIERRE","022141 P","R3",1.22,"19050 – BILLARD CLUB SAUSSETOIS"]
[null,"HAZE PATRICK","137523 J","R3",1.43,"19021 – BILLARD CLUB CAVAILLONNAIS"]
[null,"HERBER DOMINIQUE","159610 P","R3",1.46,"19027 – ACADEMIE DE BILLARD DE BOLLENE"]
[null,"HERREMAN SERGE","119933 V","R3",1.55,"19023 – BILLARD CLUB GARDEEN"]
[null,"HMAYDA YOUSSEF","132460 Q","N3",5.53,"19056 – BILLARD CLUB DE NICE"]
[null,"JAVEY JEAN FRANCOIS","120276 A","R4",0.91,"19019 – BILLARD CLUB DE LA BAIE"]
["NC","JIMENEZ RICARDO","109065 V","R3","1.20","19055 – ACADEMIE DE BILLARD DE MENTON"]
[null,"JOLY FRANCOIS","136543 R","R3",1.07,"19084 – PHOENIX BILLARD CLUB"]
[null,"JUMEL RENE","162905 W","R4",0.8,"19027 – ACADEMIE DE BILLARD DE BOLLENE"]
["CL","JUNK ROGER","175349 X","R4",0.44,"19058 – ACADEMIE DE BILLARD DE BARBOSSI MANDELIEU"]
[null,"KOSKACH JEAN PAUL","022173 V","N3",5,"19017 – BILLARD CLUB PHOCEEN"]
[null,"LACOSSE JEAN PAUL","109977 X","N3",6.6,"19019 – BILLARD CLUB DE LA BAIE"]
[null,"LACOSTE BRUNO","147195 V","R2",2.5099999999999998,"19056 – BILLARD CLUB DE NICE"]
[null,"LACROIX JEAN MARC","168708 D","R4",0.86,"19098 – BILLARD CLUB LA FARE"]
[null,"LAGIERE CHRISTIAN","151312 V","R4",0.85,"19019 – BILLARD CLUB DE LA BAIE"]
["CL","LANARI PIERRE","175999 D","R4",0.69,"19056 – BILLARD CLUB DE NICE"]
["NC","LANDOIS DOMINIQUE","179135 M","R4","1.00","19055 – ACADEMIE DE BILLARD DE MENTON"]
[null,"LANNURIEN THIERRY","168288 X","R2",1.95,"19023 – BILLARD CLUB GARDEEN"]
[null,"LAPLANCHE YVON","022190 M","R3",1.75,"19059 – BILLARD CLUB ROQUEBRUNOIS"]
[null,"LATIL YVES","022192 O","R3",1.36,"19025 – BILLARD CLUB SISTERONNAIS"]
["NC","LAUNAY MICHEL","178252 L","R4",0.5,"19058 – ACADEMIE DE BILLARD DE BARBOSSI MANDELIEU"]
[null,"LAVASTROU ROGER","022195 R","R3",1.3,"19014 – BILLARD CLUB AVIGNONNAIS"]
[null,"LE FAUCHEUR LAURENT","163278 B","R3",1.0900000000000001,"19098 – BILLARD CLUB LA FARE"]
[null,"LE MOING FRANCOIS","136216 C","R3",1.1499999999999999,"19056 – BILLARD CLUB DE NICE"]
[null,"LEBAR PATRICK","110799 N","R1",3.44,"19090 – BILLARD AMATEUR ROGNAC"]
[null,"LEBRIEZ MICHEL","022200 W","R2",2.13,"19058 – ACADEMIE DE BILLARD DE BARBOSSI MANDELIEU"]
[null,"LECOQ ARNAUD","141504 M","R3",1.76,"19012 – SALON BILLARD CLUB"]
[null,"LECOQ SYLVIE","151648 K","R4",0.24,"19012 – SALON BILLARD CLUB"]
[null,"LEDU GERARD","135537 Z","R4",0.44,"19006 – BILLARD CLUB CARPENTRASSIEN"]
["CL","LEDUCQ MORGAN","105373 V","R2",2.2599999999999998,"19014 – BILLARD CLUB AVIGNONNAIS"]
[null,"LEFEBVRE RENE","132349 J","R3",0.99,"19056 – BILLARD CLUB DE NICE"]
[null,"LEMARTINET ROBERT","110379 J","R3",1.27,"19019 – BILLARD CLUB DE LA BAIE"]
[null,"LEROY ANDRE","022206 C","R3",1.3,"19058 – ACADEMIE DE BILLARD DE BARBOSSI MANDELIEU"]
["CL","LETELLIER ALAIN","176350 K","R4",0.76,"19090 – BILLARD AMATEUR ROGNAC"]
[null,"LEVAVASSEUR ROBERT","131535 B","R1",4.12,"19025 – BILLARD CLUB SISTERONNAIS"]
[null,"LEVEQUE ARNAUD","150633 G","R4",0.89,"19007 – BILLARD CLUB BERROIS"]
[null,"LEVEQUE DAVID","141067 R","R2",2,"19007 – BILLARD CLUB BERROIS"]
[null,"LIEGEOIS DOMINIQUE","022209 F","R1",3.7,"19027 – ACADEMIE DE BILLARD DE BOLLENE"]
[null,"LIENHARDT JEAN CLAUDE","013596 Y","R1",4.4800000000000004,"19019 – BILLARD CLUB DE LA BAIE"]
[null,"LISI ROGER","146375 V","R4",0.82,"19007 – BILLARD CLUB BERROIS"]
[null,"LISSAJOUX JEAN CLAUDE","168722 T","R4",0.88,"19050 – BILLARD CLUB SAUSSETOIS"]
[null,"LOSTAO DOMINIQUE","168030 R","R4",0.7,"19058 – ACADEMIE DE BILLARD DE BARBOSSI MANDELIEU"]
[null,"LUCENET PAUL","162076 V","R3",1.81,"19009 – CLUB BILLARD ISTREEN"]
[null,"LUVISON JEAN","022221 R","R4",0.86,"19012 – SALON BILLARD CLUB"]
[null,"MACIA RENE","114274 E","N3",5.83,"19057 – ACADEMIE VENCOISE DE BILLARD"]
[null,"MAI VIN","136398 C","R3",1.22,"19106 – BILLARD CLUB VINONNAIS"]
[null,"MALLEVAL GERARD","100910 E","R3",1.27,"19023 – BILLARD CLUB GARDEEN"]
[null,"MANGROLLE DIDIER","164991 N","R4",0.67,"19057 – ACADEMIE VENCOISE DE BILLARD"]
["CL","MARCHANDISE MAURAND JACQUELINE","177467 Z","R4",0.16,"19025 – BILLARD CLUB SISTERONNAIS"]
[null,"MARCHETTO HUGO","148327 A","R4",0.62,"19090 – BILLARD AMATEUR ROGNAC"]
[null,"MARCHIOLLI LAURE","103565 H","R4",0.31,"19007 – BILLARD CLUB BERROIS"]
[null,"MARCIANO GEORGES","108280 Q","R2",1.94,"19058 – ACADEMIE DE BILLARD DE BARBOSSI MANDELIEU"]
[null,"MARTIN THOMAS","137032 M","R3",1.35,"19027 – ACADEMIE DE BILLARD DE BOLLENE"]
[null,"MASSON DENIS","015513 R","R3",1.52,"19023 – BILLARD CLUB GARDEEN"]
[null,"MATHIEU CLAUDE","129498 S","R3",1.05,"19098 – BILLARD CLUB LA FARE"]
[null,"MAUDUIT DIDIER","017615 N","R3",1,"19009 – CLUB BILLARD ISTREEN"]
[null,"MAURON BERNARD","149391 G","R2",1.49,"19023 – BILLARD CLUB GARDEEN"]
[null,"MAYNARD ALEXANDRE","112015 H","R3",1.37,"19056 – BILLARD CLUB DE NICE"]
[null,"MAZAURIC STEPHANE","022248 S","N1",9.51,"19059 – BILLARD CLUB ROQUEBRUNOIS"]
[null,"MELLET PIERRE","144802 I","R2",2.16,"19027 – ACADEMIE DE BILLARD DE BOLLENE"]
[null,"MENCO FRANCIS","022251 V","N3",5.31,"19012 – SALON BILLARD CLUB"]
[null,"MENENDEZ LORENZO","157382 S","R4",0.47,"19050 – BILLARD CLUB SAUSSETOIS"]
[null,"METAIS ALBAN","152604 Z","R3",1.53,"19006 – BILLARD CLUB CARPENTRASSIEN"]
[null,"MEUNIER GILLES","103622 M","R2",1.96,"19055 – ACADEMIE DE BILLARD DE MENTON"]
[null,"MEYER LUC","022260 E","R1",3.49,"19023 – BILLARD CLUB GARDEEN"]
[null,"MICHEL GROSJEAN CEDRIC","133204 G","R2",3.17,"19057 – ACADEMIE VENCOISE DE BILLARD"]
[null,"MILLOT ROBERT","172218 T","R4",0.77,"19025 – BILLARD CLUB SISTERONNAIS"]
[null,"MOGLIA EMILE","022266 K","R1",4.13,"19014 – BILLARD CLUB AVIGNONNAIS"]
[null,"MOLAND PHILIPPE","022268 M","R2",2.67,"19059 – BILLARD CLUB ROQUEBRUNOIS"]
["NC","MONNET JEAN CLAUDE","022271 P","R1",4,"19021 – BILLARD CLUB CAVAILLONNAIS"]
[null,"MONTAY JEAN CLAUDE","014997 V","R2",1.51,"19027 – ACADEMIE DE BILLARD DE BOLLENE"]
[null,"MONTESINOS GILLES","136279 N","R4",0.7,"19012 – SALON BILLARD CLUB"]
[null,"MORENO BASTIEN","101279 J","N3",6.91,"19007 – BILLARD CLUB BERROIS"]
[null,"MORPOURGO SIMON","022278 W","R3",1.04,"19007 – BILLARD CLUB BERROIS"]
[null,"MOUSSIER PATRICK","151456 B","R3",0.94,"19056 – BILLARD CLUB DE NICE"]
[null,"MUNOS JEAN","109063 T","R1",4.12,"19050 – BILLARD CLUB SAUSSETOIS"]
[null,"MUNOS VINCENT","109708 O","R2",2.59,"19050 – BILLARD CLUB SAUSSETOIS"]
[null,"N GUYEN VAN DUC MAX","141788 K","R3",1.02,"19007 – BILLARD CLUB BERROIS"]
[null,"NAPOLI SALVATORE","107150 E","R4",0.79,"19006 – BILLARD CLUB CARPENTRASSIEN"]
[null,"NARDELLI PASCAL","174977 S","R3",1.05,"19061 – ACAD.BILLARD ST RAPHAEL"]
["CL","NATELLA IDA","154573 P","R4",0.52,"19056 – BILLARD CLUB DE NICE"]
[null,"NATELLA ROGER","154572 N","R3",1.62,"19056 – BILLARD CLUB DE NICE"]
[null,"ORSAL SERGE","154378 C","R4",0.73,"19012 – SALON BILLARD CLUB"]
[null,"OUDIA DYLAN","137031 L","R4",0.3,"19027 – ACADEMIE DE BILLARD DE BOLLENE"]
[null,"OUDOUX GERARD","128468 C","R3",1.08,"19023 – BILLARD CLUB GARDEEN"]
[null,"PACZESNY FABRICE","150400 D","R3",1.52,"19098 – BILLARD CLUB LA FARE"]
[null,"PAGANONI GEORGES","022302 U","N3",3.7,"19023 – BILLARD CLUB GARDEEN"]
[null,"PAQUET MICHEL","118659 V","R4",0.66,"19014 – BILLARD CLUB AVIGNONNAIS"]
[null,"PARINELLO RENE","022308 A","R1",4.08,"19023 – BILLARD CLUB GARDEEN"]
[null,"PARIZE MICHEL","105442 M","R1",3.76,"19058 – ACADEMIE DE BILLARD DE BARBOSSI MANDELIEU"]
["CL","PAU CHRISTINE","177193 B","R4",0.15,"19025 – BILLARD CLUB SISTERONNAIS"]
[null,"PAVIOT DIDIER","153692 G","R3",1.51,"19023 – BILLARD CLUB GARDEEN"]
[null,"PEGULLO PATRICK","022314 G","R2",1.88,"19023 – BILLARD CLUB GARDEEN"]
[null,"PELLAT FRANCIS","141673 Z","R2",2.5,"19025 – BILLARD CLUB SISTERONNAIS"]
[null,"PELOUIN JEAN FRANCOIS","144779 L","N1",16.329999999999998,"19019 – BILLARD CLUB DE LA BAIE"]
[null,"PENEDO JONATHAN","132787 F","R2",2.46,"19106 – BILLARD CLUB VINONNAIS"]
[null,"PENEDO MANUEL","103577 T","R1",4.72,"19106 – BILLARD CLUB VINONNAIS"]
[null,"PEREIRA NICOLAS","132699 V","R4",0.89,"19023 – BILLARD CLUB GARDEEN"]
[null,"PEREZ CHRISTIAN","130773 T","R3",1.22,"19009 – CLUB BILLARD ISTREEN"]
[null,"PERIES MICHEL","022319 L","R2",1.97,"19025 – BILLARD CLUB SISTERONNAIS"]
[null,"PERIS MICHEL","022321 N","R4",0.56000000000000005,"19056 – BILLARD CLUB DE NICE"]
[null,"PERRIN BERNARD","015932 U","R3",1.24,"19098 – BILLARD CLUB LA FARE"]
[null,"PERRY GUY","130433 R","R4",0.69,"19061 – ACAD.BILLARD ST RAPHAEL"]
[null,"PICOLLET MANUEL","129330 G","N3",5.61,"19090 – BILLARD AMATEUR ROGNAC"]
[null,"PIELIN PASCAL","022330 W","N3",5.17,"19012 – SALON BILLARD CLUB"]
[null,"PIGNATEL FLORENT","112316 W","N3",9.57,"19021 – BILLARD CLUB CAVAILLONNAIS"]
[null,"PINARD PATRICE","105404 A","R1",3.68,"19012 – SALON BILLARD CLUB"]
[null,"PINNA ALAIN","022332 Y","N1",22.13,"19017 – BILLARD CLUB PHOCEEN"]
[null,"PINNA VINCENT","148229 T","R4",0.47,"19017 – BILLARD CLUB PHOCEEN"]
[null,"PIONE GUY","022335 B","R2",2.35,"19007 – BILLARD CLUB BERROIS"]
["CL","PIRO COUDERC MARIE LAURE","177205 P","R4",0.18,"19025 – BILLARD CLUB SISTERONNAIS"]
[null,"POIRET JEAN MARC","022341 H","R3",1.31,"19061 – ACAD.BILLARD ST RAPHAEL"]
[null,"POIRIER DOMINIQUE","108010 G","R3",1.56,"19061 – ACAD.BILLARD ST RAPHAEL"]
["CL","PORA JEAN PAUL","170697 Q","R4",0.95,"19009 – CLUB BILLARD ISTREEN"]
["CL","POUGIN JEAN FRANCOIS","022346 M","R3",1,"19058 – ACADEMIE DE BILLARD DE BARBOSSI MANDELIEU"]
[null,"POUJOL JEAN PAUL","022347 N","R3",1.05,"19014 – BILLARD CLUB AVIGNONNAIS"]
[null,"POULAIN FREDERIC","144719 D","R3",1.69,"19016 – BILLARD CLUB ORANGEOIS"]
[null,"POURCHASSE JOEL","022348 O","R4",0.81,"19023 – BILLARD CLUB GARDEEN"]
[null,"POZNANSKI JEAN MICHEL","022349 P","R2",2.99,"19012 – SALON BILLARD CLUB"]
[null,"POZNANSKI LOIC","105485 D","R2",2.64,"19012 – SALON BILLARD CLUB"]
[null,"PRACHAR JEAN PIERRE","017857 V","R3",0.99,"19059 – BILLARD CLUB ROQUEBRUNOIS"]
[null,"PROFIT GILBERT","143885 B","R4",0.48,"19056 – BILLARD CLUB DE NICE"]
[null,"PROTAT MICHEL","146946 Z","N3",4.9000000000000004,"19014 – BILLARD CLUB AVIGNONNAIS"]
["CL","PUICHAULT REMY","172219 V","R3",1.28,"19025 – BILLARD CLUB SISTERONNAIS"]
[null,"PUJA ANDRE","121022 S","R3",1.21,"19007 – BILLARD CLUB BERROIS"]
[null,"PUT MARCEL","022353 T","R4",0.74,"19006 – BILLARD CLUB CARPENTRASSIEN"]
[null,"QUANTIN MICHEL","022354 U","R2",2.65,"19098 – BILLARD CLUB LA FARE"]
[null,"QUEZEL ANDRE","136544 S","R4",0.82,"19014 – BILLARD CLUB AVIGNONNAIS"]
[null,"RANC ALAIN","136205 R","R3",1.1200000000000001,"19027 – ACADEMIE DE BILLARD DE BOLLENE"]
[null,"RAUD DANIEL","161645 B","R3",1.54,"19098 – BILLARD CLUB LA FARE"]
["CL","RAVENET FRANCIS","157788 J","R3",1.82,"19059 – BILLARD CLUB ROQUEBRUNOIS"]
[null,"RAVERDINO JULIEN","103561 D","N3",5.53,"19057 – ACADEMIE VENCOISE DE BILLARD"]
[null,"REMY DE COURNON THIERRY","172684 A","R4",0.54,"19019 – BILLARD CLUB DE LA BAIE"]
[null,"REVALOR MICHEL","119696 S","R2",1.78,"19050 – BILLARD CLUB SAUSSETOIS"]
[null,"RIBOLLA PATRICE","022366 G","N3",4.1500000000000004,"19056 – BILLARD CLUB DE NICE"]
[null,"RICART ANDRE","133646 G","R3",1.45,"19009 – CLUB BILLARD ISTREEN"]
[null,"RICHARD MATHIEU","137033 N","R4",0.34,"19027 – ACADEMIE DE BILLARD DE BOLLENE"]
[null,"RIFFET BERNARD","125943 Z","R3",1.1399999999999999,"19014 – BILLARD CLUB AVIGNONNAIS"]
[null,"RIGNOLS PHILIPPE","022372 M","R2",1.81,"19021 – BILLARD CLUB CAVAILLONNAIS"]
[null,"RIGOLLET PIERRE","023064 C","N1",10.66,"19025 – BILLARD CLUB SISTERONNAIS"]
[null,"ROBBE RAYMOND","134183 X","R3",1.43,"19050 – BILLARD CLUB SAUSSETOIS"]
[null,"ROBERT DIDIER","022450 M","N3",6.52,"19014 – BILLARD CLUB AVIGNONNAIS"]
[null,"RODRIGUES STEVE","171160 T","R4",0.6,"19090 – BILLARD AMATEUR ROGNAC"]
[null,"ROGER GERARD","134843 H","R4",0.81,"19021 – BILLARD CLUB CAVAILLONNAIS"]
[null,"RONSAIN JEAN JACQUES","166175 A","R3",1.07,"19012 – SALON BILLARD CLUB"]
[null,"ROTH ALAIN","166176 B","R4",0.64,"19012 – SALON BILLARD CLUB"]
[null,"ROUANET CLAUDE","163166 E","R3",1.67,"19025 – BILLARD CLUB SISTERONNAIS"]
[null,"ROUGON ROBERT","101518 O","R1",4.1100000000000003,"19090 – BILLARD AMATEUR ROGNAC"]
[null,"ROUX CLAUDE","022384 Y","R1",3.84,"19050 – BILLARD CLUB SAUSSETOIS"]
[null,"SALAMA ALAIN","136546 U","R3",1.32,"19021 – BILLARD CLUB CAVAILLONNAIS"]
["CL","SALES THIERRY","175174 G","R4",0.93,"19061 – ACAD.BILLARD ST RAPHAEL"]
[null,"SANTIAGO JEAN JOSEPH","022391 F","N3",5.15,"19050 – BILLARD CLUB SAUSSETOIS"]
[null,"SARRALDE LOUIS","014138 U","R4",0.91,"19021 – BILLARD CLUB CAVAILLONNAIS"]
[null,"SAVINA GERARD","022398 M","R3",1.04,"19012 – SALON BILLARD CLUB"]
[null,"SAVOIA MICKAEL","122939 L","R3",1.03,"19050 – BILLARD CLUB SAUSSETOIS"]
[null,"SAVOIA PATRICK","113222 S","R3",1.3,"19050 – BILLARD CLUB SAUSSETOIS"]
[null,"SCHAEFER ERNEST ROBERT","149694 L","R3",1.1100000000000001,"19006 – BILLARD CLUB CARPENTRASSIEN"]
[null,"SCHEKLER JEAN FLORIAN","022399 N","R3",1.1399999999999999,"19061 – ACAD.BILLARD ST RAPHAEL"]
[null,"SCHENK ROBERT","136540 O","R4",0.78,"19056 – BILLARD CLUB DE NICE"]
[null,"SCHMIDT CLAUDE","022401 P","N1",7.38,"19023 – BILLARD CLUB GARDEEN"]
[null,"SEROR BERNARD","152347 V","R4",0.89,"19058 – ACADEMIE DE BILLARD DE BARBOSSI MANDELIEU"]
[null,"SEYNHAEVE BAUDOUIN","148608 F","N1",18.75,"19023 – BILLARD CLUB GARDEEN"]
[null,"SICARD GEORGES","163238 H","R4",0.95,"19025 – BILLARD CLUB SISTERONNAIS"]
[null,"SIEGLER JEAN PIERRE","168834 Q","R1",3.85,"19006 – BILLARD CLUB CARPENTRASSIEN"]
[null,"SIMON GERARD","010203 L","R2",2.36,"19014 – BILLARD CLUB AVIGNONNAIS"]
[null,"SINANIAN JEAN PAUL","022412 A","R1",4.5999999999999996,"19017 – BILLARD CLUB PHOCEEN"]
[null,"SOLTANI OMAR","103578 U","R2",2.3199999999999998,"19106 – BILLARD CLUB VINONNAIS"]
[null,"SOULAS GERARD","125929 L","R3",0.9,"19019 – BILLARD CLUB DE LA BAIE"]
[null,"SOUTEYRAND CHRISTIAN","149696 N","R4",0.92,"19006 – BILLARD CLUB CARPENTRASSIEN"]
[null,"SQUIZZARO BERNARD","112421 X","R3",1.01,"19017 – BILLARD CLUB PHOCEEN"]
[null,"STEINMANN SEBASTIEN","020790 Q","R2",1.94,"19061 – ACAD.BILLARD ST RAPHAEL"]
[null,"STEPHAN OLIVIER","125931 N","R1",2.4900000000000002,"19025 – BILLARD CLUB SISTERONNAIS"]
[null,"STERCKX PIERRE","144720 E","R4",0.81,"19016 – BILLARD CLUB ORANGEOIS"]
[null,"SUEUR PASCAL","165039 Q","R3",0.8,"19004 – JFP BILLARD DE VIDAUBAN"]
[null,"TARDIEUX LUC","022429 R","R1",2.88,"19007 – BILLARD CLUB BERROIS"]
[null,"TARDY JEAN CLAUDE","133907 H","R4",0.64,"19014 – BILLARD CLUB AVIGNONNAIS"]
[null,"TARDY PIERRE YVES","143024 Y","R3",1.24,"19058 – ACADEMIE DE BILLARD DE BARBOSSI MANDELIEU"]
[null,"TATTIS HENRI","118668 E","R3",1.49,"19050 – BILLARD CLUB SAUSSETOIS"]
[null,"TELOT DOMINIQUE","123701 T","R2",2.4300000000000002,"19059 – BILLARD CLUB ROQUEBRUNOIS"]
[null,"TERZIAN BERNARD","148464 Z","R3",1.44,"19090 – BILLARD AMATEUR ROGNAC"]
[null,"THEVENET JEAN CLAUDE","014232 K","R3",1.1100000000000001,"19025 – BILLARD CLUB SISTERONNAIS"]
[null,"THOMAS PHILIPPE","168687 F","R4",0.54,"19023 – BILLARD CLUB GARDEEN"]
[null,"TIMSIT SERGE","148252 T","R4",0.74,"19023 – BILLARD CLUB GARDEEN"]
[null,"TOLEDANO ARMAND","111163 N","R1",3.37,"19017 – BILLARD CLUB PHOCEEN"]
[null,"TONNELIER JEAN PIERRE","132786 E","R3",1.36,"19106 – BILLARD CLUB VINONNAIS"]
[null,"TORES JEAN LUC","135554 Q","R2",2.09,"19090 – BILLARD AMATEUR ROGNAC"]
[null,"TOUREILLE ALAIN","139062 O","R4",0.9,"19025 – BILLARD CLUB SISTERONNAIS"]
[null,"TRASTOUR FREDERIC","022444 G","R1",4.5,"19057 – ACADEMIE VENCOISE DE BILLARD"]
[null,"TREMEAU PHILIPPE","018691 X","N3",7.78,"19059 – BILLARD CLUB ROQUEBRUNOIS"]
[null,"TRIVINO RENE","022446 I","N3",3.76,"19023 – BILLARD CLUB GARDEEN"]
[null,"TROEGNER DANIEL","018722 C","R1",4.74,"19059 – BILLARD CLUB ROQUEBRUNOIS"]
[null,"TRUCCO DAMIEN","107457 Z","N3",5.8,"19023 – BILLARD CLUB GARDEEN"]
[null,"TRUCCO DOMINIQUE","022448 K","N3",6.32,"19023 – BILLARD CLUB GARDEEN"]
[null,"TRUEL JACQUES","118651 N","R3",1.38,"19058 – ACADEMIE DE BILLARD DE BARBOSSI MANDELIEU"]
[null,"VASSE JEAN PIERRE","129880 K","R4",0.34,"19019 – BILLARD CLUB DE LA BAIE"]
[null,"VASTEL BERNARD","163827 Y","N3",6.63,"19056 – BILLARD CLUB DE NICE"]
["CL","VAUTRIN JEAN","022459 V","R3",1.48,"19056 – BILLARD CLUB DE NICE"]
[null,"VERRIER JEAN PIERRE","125928 K","N3",5.37,"19012 – SALON BILLARD CLUB"]
[null,"VIBOUREL ETIENNE","022467 D","R2",2.27,"19023 – BILLARD CLUB GARDEEN"]
[null,"VICTOR DANIEL","147412 F","R4",0.59,"19019 – BILLARD CLUB DE LA BAIE"]
[null,"VIDAL JEAN PIERRE","149593 B","R4",0.84,"19014 – BILLARD CLUB AVIGNONNAIS"]
[null,"VIGNE PHILIPPE","014327 B","N3",6.01,"19014 – BILLARD CLUB AVIGNONNAIS"]
[null,"VILLARD PATRICE","164317 F","R4",0.84,"19006 – BILLARD CLUB CARPENTRASSIEN"]
[null,"VILLASEVIL ANTONIO","101485 H","R2",2.88,"19090 – BILLARD AMATEUR ROGNAC"]
[null,"VINCENT REGIS","022472 I","R3",1.1000000000000001,"19090 – BILLARD AMATEUR ROGNAC"]
[null,"VIOU GERARD","147607 S","R2",2.27,"19098 – BILLARD CLUB LA FARE"]
[null,"VISCONTI JEAN","138731 V","R3",1.1100000000000001,"19090 – BILLARD AMATEUR ROGNAC"]
[null,"VITALE BENOIT","022475 L","R3",1.07,"19056 – BILLARD CLUB DE NICE"]
[null,"VITALIEN PIERRE","119674 W","R3",1.77,"19016 – BILLARD CLUB ORANGEOIS"]
[null,"VIVALDI ANDRE","022476 M","N1",12.96,"19106 – BILLARD CLUB VINONNAIS"]
[null,"VUILLAUME JEAN CLAUDE","154571 M","R3",0.95,"19056 – BILLARD CLUB DE NICE"]
[null,"VUILLERMET PIERRE","112318 Y","R3",1.58,"19098 – BILLARD CLUB LA FARE"]
[null,"VULTAGGIO PIERRE","022480 Q","R2",2.06,"19058 – ACADEMIE DE BILLARD DE BARBOSSI MANDELIEU"]
[null,"WILLETTE MARC","022483 T","R2",2.2200000000000002,"19009 – CLUB BILLARD ISTREEN"]
[null,"WOILLEZ FRANCIS","101283 N","R4",0.81,"19014 – BILLARD CLUB AVIGNONNAIS"]
[null,"XUEREF JEAN MARIE","152049 W","R2",2.2599999999999998,"19019 – BILLARD CLUB DE LA BAIE"]
[null,"ZANDRINO ALAIN","134311 V","R2",1.96,"19007 – BILLARD CLUB BERROIS"]
[null,"ZOPPI AIME","144788 U","R1",3.27,"19106 – BILLARD CLUB VINONNAIS"]
[null,"ZOPPI CEDRIC","125457 H","Masters",43.56,"19106 – BILLARD CLUB VINONNAIS"]

{"sheet":"FICHE-JOUEUR","index":3,"n_rows":413,"n_cols":3,"rows_kept":413,"cut":false,"hidden":true,"merged":[[0,0,0,2]]}
["LMB \nFICHE JOUEURS\n"]
["Licence","NOM","PRENOM"]
["106287Z","ABAD","YANNICK"]
["169265J","ABDALLAH","ANTHONY"]
["159403P","ABELA","JOSEPH"]
["169267L","ACOCA","WILLIAM"]
["147622J","ESTABLIER","PIERRE"]
["165301A","BARTH","JEAN PAUL"]
["021810W","AKNIN","GABRIEL"]
["147980Y","AKTAS","JEAN"]
["149448T","ALESSI","JEAN PIERRE"]
["169144C","ALEXANIAN","ANTOINE"]
["151459E","ALIBERT","BRUNO"]
["159130S","ALVAREZ","PHILIPPE"]
["152035F","ALVISET","GUY"]
["155531F","AMOUROUX","LUC"]
["162879S","AMOUROUX","JACQUES ANTOINE"]
["153111A","ANDRIEUX","STEPHANE"]
["021818E","ANDRY","JEAN FRANCOIS"]
["021819F","ANGUE","PATRICK"]
["021820G","ANNESTAY","JACQUES"]
["021821H","ANTONIN","ALAIN"]
["021824K","ARBAUD","STEPHANE"]
["166320H","ATHLANI","MICHEL"]
["106513R","AUDIBERT","JEAN PIERRE"]
["138454E","AUDOUIN","JEAN JACQUES"]
["012464K","AZERAD","HUGO"]
["021839Z","AZOULAY","ALAIN"]
["115304U","BAILLON","JEAN"]
["153554G","BALESTRI","MAURICE"]
["023184S","BALLIGAND","SERGE"]
["109917P","BARBANNEAU","FREDERIC"]
["018535X","BARDET","JEAN PIERRE"]
["122300W","BARRALLON","JEAN PAUL"]
["115343H","BARTOLETTI","JULIEN"]
["129911P","BASSIGNANA","ROBERT"]
["103568K","BASSOUL","JEAN MARIE"]
["021860U","BAYARD","JEAN CLAUDE"]
["153113C","BECQ","GILLES"]
["021865Z","BELHASSEN","BENJAMIN"]
["132789H","BELTRITTI","JEAN YVES"]
["021872G","BENAVIDES","CLAUDE"]
["138275H","BENAVIDES","GERARD"]
["124802C","BENDAVID","KARINE"]
["159238K","BENIER","PATRICK"]
["160011A","BENSAID","NOEL"]
["125945B","BERNAT","JEAN PIERRE"]
["115001D","BERNICHON","PASCAL"]
["159202W","BIARD","ANDRE"]
["168684C","BODET","DENIS"]
["016248Y","BOFFA","BERNARD"]
["168836S","BOLAND","CHRISTIAN"]
["021894C","BONELLO","LUCIEN"]
["150422C","BONNEMAISON","DENIS"]
["101352E","BONNET","JONATHAN"]
["021900I","BONTOUX","MAX"]
["149287T","BORDES","BERNARD"]
["149288V","BORDES","CATHIE"]
["160000N","BOSSOT","JEAN"]
["155529D","BOULANT","CLAUDE"]
["021911T","BOURDELLES","LAURENT"]
["122662U","BOUTILLE","NICOLAS"]
["118665B","BOUTTIER","CHARLES"]
["125921D","BOUTTIER","CAROLINE"]
["149613Y","BOVET","MICHEL"]
["168877M","BOYER","ANNE MARIE"]
["021918A","BREDAT","RENE"]
["152345S","BREPSON","MARTIAL"]
["113104E","BRIAND","ALAIN"]
["021920C","BRIOIT","DOMINIQUE"]
["114733V","BRUANT","SYLVAIN"]
["136581D","BRUNERIE","JEAN LOUIS"]
["117642S","BUFFART","MICHELE"]
["109188O","BUI THAI","NINH"]
["155679R","BURELLI","GEORGES"]
["162877Q","BUROIS","FREDERIQUE"]
["151533K","BURON","JEAN LOUIS"]
["112311R","CACHO","DIDIER"]
["144785R","CAILLAUD","DANIEL"]
["158342L","CALUSIO","J PIERRE"]
["159692D","CANAL","FRANCOIS"]
["021944A","CAO","HUU TUOI"]
["146885L","CARAIL","MICHEL"]
["021946C","CARDINALI","DENIS"]
["101302G","CARPENTRAS","MICHEL"]
["152346T","CARRE","PIERRE"]
["118684U","CESARO","JEAN CLAUDE"]
["161620Z","CHABOUD","JACQUES"]
["021960Q","CHAIX","JOEL"]
["143166K","CHANTEUX","ALAIN"]
["151534L","CHAPLIN","CHRISTIAN"]
["021967X","CHARBIT","JEAN MARC"]
["152655E","CHEVRIER","JACQUES"]
["152831W","CHEVRIER","CAMILLE"]
["160332Z","CHICARD","ALAIN"]
["108854S","CHUZEVILLE","GILLES"]
["168880Q","CLAUDEN","PHILIPPE"]
["129497R","CLEMENT","GERARD"]
["106896K","CLUS","SANDY"]
["012827J","COHEN","RICHARD"]
["166294E","COLOMBET","MARIE"]
["166295F","COLOMBET","MICHEL"]
["166177C","CONTRAIN","JEROME"]
["021985P","COPPIN","JEAN MICHEL"]
["164007T","CORBIN","LUC"]
["106512Q","CORDONNIER","ROGER"]
["148136S","COSTAZ","ALAIN"]
["125938U","COSTE","PHILIPPE"]
["101268Y","COTARD","SANDRINE"]
["119932U","COUPET","PHILIPPE"]
["168287W","COURSAULT","BERNADETTE"]
["168685D","COZETTE","SYLVIE"]
["021996A","CREUZOT","PATRICE"]
["152067Q","CROUZET","JEAN ANDRE"]
["144718C","D ANTONIO","JEROME"]
["126747X","DAMIEN","JACQUES"]
["022002G","DAMON","GERARD"]
["022003H","DAMON","OLIVIER"]
["144640C","DANCARVILLE","GUY"]
["155526A","DAVID","THIERRY"]
["139487X","DE GRYSE","GERARD"]
["140113Z","DE HAAN","PATRICK"]
["163348C","DE LOOSE","FELIX"]
["159371E","DE LUCA","JEREMY"]
["127655V","DE RIGAL","DANIEL"]
["151535M","DE ROOY","PETER"]
["022009N","DEBOS","CHARLES"]
["119889D","DEFFE","MICHEL"]
["020635R","DEFRETIN","JOEL"]
["016772C","DEL MEDICO","JEAN"]
["152184S","DELAIRE","SYLVAIN"]
["166003N","DELAIRE","JEAN PIERRE"]
["022014S","DELATTRE","RAYMOND"]
["166346L","DELUC","BERNARD"]
["168662D","DEMARCQ","JEAN FRANCOIS"]
["159076J","DEMERLIAC","BRUNO"]
["142358I","DESMERO","RAYMOND"]
["115051B","DESWAZIERE","MICHEL"]
["163923C","DETAND","CHRISTIAN"]
["022033L","DHAINAUT","JEAN FRANCOIS"]
["135014W","DI BIN","JEAN MARIE"]
["160331Y","DION","JEAN LOUIS"]
["142363N","DONABEDIAN","DANIEL"]
["022039R","DOS SANTOS","FRANCIS"]
["169123E","DUBOC","BERTRAND"]
["152038J","DUBOURDEAUX","ROBERT"]
["013022W","DUBREUIL","FRANCK"]
["154651Z","DUCA","ALFONSO"]
["138116E","DUFLOT","ALAIN"]
["013037L","DUMET","BRUNO"]
["105621J","DUPUIS","MICHEL"]
["022049B","DURAND","FREDERIC"]
["022050C","DURAND","HERVE"]
["022052E","DUSFOUR","RENE"]
["102285B","DUSSAULE","PIERRE"]
["140809T","EL MEGHARY","MAROUANE"]
["163467G","ELEOUET","DANIEL"]
["162984G","FAISSOLLE","CHRISTELLE"]
["022066S","FAVARIO","CHRISTIAN"]
["022067T","FERAUD","GERARD"]
["129036Y","FERHAT","ACHOUR"]
["013111H","FERNANDEZ","MARC"]
["122658Q","FERRO","PHILIPPE"]
["114481D","FLORENT","CEDRIC"]
["101139Z","FONTAINE","DANY"]
["127035Z","FOREL","PHILIPPE"]
["152014H","FORGET","LIONEL"]
["022082I","FOSSATI","BRUNO"]
["022084K","FRANCO","GILBERT"]
["118688Y","FRANCO","HENRY"]
["167290M","FROMEYER","CORINNE"]
["159060R","FURNON","ROGER"]
["103216W","GABETTO","STEPHANE"]
["142316S","GALARDINI","RICHARD"]
["145236A","GAMBINO","NATHAN"]
["147288W","GAMEN","ANDRE"]
["022097X","GATTO","ANTOINE"]
["112833T","GAUCHER","JULIEN"]
["116278G","GAVALDA","PIERRE"]
["125944A","GAVANON","ANDRE"]
["163279C","GELAS","BERNARD"]
["150065P","GENDRAUD","PHILIPPE"]
["022103D","GERARD","PASCAL"]
["167330F","GERARD","THOMAS"]
["022104E","GERVAIS","GUILLAUME"]
["101282M","GHU","GERARD"]
["022108I","GIANNATTASIO","LUCIEN"]
["118661X","GIBARROUX","CHRISTOPHE"]
["149390F","GIFFARD","PHILIPPE"]
["022113N","GIMENEZ","SERGE"]
["022115P","GIOVANNETTI","DAMIEN"]
["129718E","GIRARD","JACQUES"]
["159240M","GLEISES","CHRISTIAN"]
["022120U","GLEIZES","JEAN"]
["157852D","GODARD","PASCAL"]
["131925B","GOUDENECHE","BERNARD"]
["022129D","GOUIRAN","GEORGES"]
["104054C","GOURSEAUD","YVES"]
["101259P","GOUZIEN","RENAUD"]
["166216V","GOUZIEN","YANN"]
["144636Y","GOUZOUGUEN","CHRISTIAN"]
["163514H","GRANDMAIRE","ROLAND"]
["149576H","GREGOIRE","J CLAUDE"]
["022132G","GRIFFON","JEAN JACQUES"]
["101403D","GROS","ROLAND"]
["107059R","GROS","MARIE PAULE"]
["135013V","GUERI","ROBERT"]
["103615F","GUERIN","RAYMOND"]
["022135J","GUERINEAU","THIERRY"]
["144796C","GUERINEAU","BRUNO"]
["104475H","GUEUG","PIERRE"]
["022137L","GUIBERT","JEAN MARIE"]
["109714U","HAEBERLE","JEAN"]
["011966G","HAHN","DANIEL"]
["022141P","HAROUTUNIAN","PIERRE"]
["166328R","HARTENSTEIN","BRUNO"]
["137523J","HAZE","PATRICK"]
["119933V","HERREMAN","SERGE"]
["137004K","HEURTAULT","JACKY"]
["163015Q","HUREL","JACQUES"]
["148913M","HURSTEL","BERNARD"]
["169266K","JANNOT","FREDERIC"]
["120276A","JAVEY","JEAN FRANCOIS"]
["022163L","JOB","GEORGES"]
["120814S","JONNARD","FREDERIC"]
["109412E","JUIGNET","CHRISTIAN"]
["162905W","JUMEL","RENE"]
["125930M","LABBE","CLAUDE"]
["109977X","LACOSSE","JEAN PAUL"]
["168708D","LACROIX","JEAN MARC"]
["168256M","LAFON","CHARLES"]
["016084Q","LANDE","GERARD"]
["168288X","LANNURIEN","THIERRY"]
["022190M","LAPLANCHE","YVON"]
["022195R","LAVASTROU","ROGER"]
["163278B","LE FAUCHEUR","LAURENT"]
["125949F","LE GUENNEC","CHRISTIAN"]
["120278C","LE MEUR","CLAUDE"]
["013510Q","LE RAY","JEAN CLAUDE"]
["141504M","LECOQ","ARNAUD"]
["117411V","LEFAUX","JEAN JACQUES"]
["110379J","LEMARTINET","ROBERT"]
["022205B","LEMESLE","FABRICE"]
["104233Z","LEMIERE","JEAN NOEL"]
["022209F","LIEGEOIS","DOMINIQUE"]
["159203X","LINA","SERGE"]
["146375V","LISI","ROGER"]
["168722T","LISSAJOUX","JEAN CLAUDE"]
["166755F","LOPEZ","TONY"]
["169129L","LORION","PHILIPPE"]
["022217N","LORKOVIC","JOSEPH"]
["168030R","LOSTAO","DOMINIQUE"]
["162076V","LUCENET","PAUL"]
["022221R","LUVISON","JEAN"]
["022223T","MACQUET","PATRICK"]
["165843P","MAGNIER","PIERRE"]
["114884Q","MAGNIEZ","JACQUES"]
["100910E","MALLEVAL","GERARD"]
["159667B","MALPAUX","GUY"]
["022229Z","MANZOLI","ANGELO"]
["101260Q","MARIOTTI","JEAN MICHEL"]
["159950J","MARME","HANS"]
["103581X","MASSERAN","PHILIPPE"]
["129498S","MATHIEU","CLAUDE"]
["017615N","MAUDUIT","DIDIER"]
["149391G","MAURON","BERNARD"]
[112015,"MAYNARD","ALEXANDRE"]
["163410V","MEALLIER","LOLA"]
["165932L","MEALLIER","RAPHAEL"]
["128466A","MEGUIN","ERIC"]
["144802I","MELLET","PIERRE"]
["152604Z","METAIS","ALBAN"]
["022260E","MEYER","LUC"]
["144792Y","MISRAKI","ROMAIN"]
["022266K","MOGLIA","EMILE"]
["167147G","MOLINA","MARIE"]
["022270O","MOLINAS","ROBERT"]
["022271P","MONNET","JEAN CLAUDE"]
["147624L","MOREELS","BERNARD"]
["151456B","MOUSSIER","PATRICK"]
["109063T","MUNOS","JEAN"]
["141788K","N GUYEN VAN DUC","MAX"]
["123392W","NARDI","LOUIS"]
["107263N","NASICA","PATRICK"]
["101269Z","NATALI","MICHEL"]
["154572N","NATELLA","ROGER"]
["154573P","NATELLA","IDA"]
["168689H","NAVARRO","BERNARD"]
["132345F","NEICHTHAUSER","GERARD"]
["128204Y","NICOLAS","JOEL"]
["146143X","NICOLE","CLAUDE"]
["154378C","ORSAL","SERGE"]
["128468C","OUDOUX","GERARD"]
["150400D","PACZESNY","FABRICE"]
["141673Z","PELLAT","FRANCIS"]
["144779L","PELOUIN","JEAN FRANCOIS"]
["103577T","PENEDO","MANUEL"]
["102907Z","PERDICARO","CAMILLE"]
["013896M","PEREIRA","CHARLES"]
["130773T","PEREZ","CHRISTIAN"]
["159241N","PEREZ","JEAN PIERRE"]
["022321N","PERIS","MICHEL"]
["150544K","PERRE","OLIVIER"]
["166927S","PEYRAN","PATRICE"]
["151709B","PIATEK","JEAN CLAUDE"]
["135135N","PICCHI","GERARD"]
["022330W","PIELIN","PASCAL"]
["112316W","PIGNATEL","FLORENT"]
["105404A","PINARD","PATRICE"]
["022336C","PIQUET","VICTOR"]
["111987F","PLAQUEVENT","ROMUALD"]
["108010G","POIRIER","DOMINIQUE"]
["022347N","POUJOL","JEAN PAUL"]
["144719D","POULAIN","FREDERIC"]
["022349P","POZNANSKI","JEAN MICHEL"]
["136544S","QUEZEL","ANDRE"]
["101290U","RANIERI","JEAN ANDRE"]
["163826X","RATON","PATRICE"]
["159200T","REGNOUARD","MICHEL"]
["133622I","RENAUD","JEAN PAUL"]
["119696S","REVALOR","MICHEL"]
["022366G","RIBOLLA","PATRICE"]
["022367H","RICHARD","GUY"]
["169268M","RIETTE","MARJORIE"]
["125943Z","RIFFET","BERNARD"]
["022372M","RIGNOLS","PHILIPPE"]
["134183X","ROBBE","RAYMOND"]
["022376Q","ROBERT","DOMINIQUE"]
["022450M","ROBERT","DIDIER"]
["169274T","ROCA","STEPHANIE"]
["103608Y","RODRIGUEZ","STEPHAN"]
["163945B","RODRIGUEZ","RONNIE"]
["134843H","ROGER","GERARD"]
["166175A","RONSSAIN","JEAN JACQUES"]
["166176B","ROTH","ALAIN"]
["101518O","ROUGON","ROBERT"]
["163989Z","ROUSSEL","ALAIN"]
["022384Y","ROUX","CLAUDE"]
["122208I","SABLON","ROGER"]
["169318R","SAFI","AZIZ"]
["136546U","SALAMA","ALAIN"]
["120008S","SAMUEL","CHRISTIAN"]
["163352G","SANCHEZ PEREZ","FRANCISCO"]
["167423G","SANTANA","ELOY"]
["022391F","SANTIAGO","JEAN JOSEPH"]
["022393H","SANTORO","ROBERT"]
["014138U","SARRALDE","LOUIS"]
["164008V","SAUVAN","HENRY"]
["144798E","SAUZE","DENIS"]
["113222S","SAVOIA","PATRICK"]
["149694L","SCHAEFER","ERNEST ROBERT"]
["136540O","SCHENK","ROBERT"]
["167170G","SEJOURNE","LAURENT"]
["022406U","SELLIER","MICHEL"]
["155543T","SEREAULT","CLAUDE"]
["149899J","SERMON","FABIO"]
["148608F","SEYNHAEVE","BAUDOUIN"]
["163238H","SICARD","GEORGES"]
["168834Q","SIEGLER","JEAN PIERRE"]
["165933M","SIMANTOB","JEAN LUC"]
["156378B","SIMIAN","FABIENNE"]
["010203L","SIMON","GERARD"]
["022412A","SINANIAN","JEAN PAUL"]
["151274D","SOLARI","ANNICK"]
["151275E","SOLARI","GERARD"]
["103578U","SOLTANI","OMAR"]
["162906X","SOUCHERE","JEAN JACQUES"]
["149696N","SOUTEYRAND","CHRISTIAN"]
["165931K","SPINNLER","JEAN LUC"]
["020790Q","STEINMANN","SEBASTIEN"]
["156278S","STRAUDO","MICHEL"]
["165039Q","SUEUR","PASCAL"]
["143055D","TABUADA","FRANCOIS"]
["022429R","TARDIEUX","LUC"]
["133907H","TARDY","JEAN CLAUDE"]
["143024Y","TARDY","PIERRE YVES"]
["123701T","TELOT","DOMINIQUE"]
["168687F","THOMAS","PHILIPPE"]
["148252T","TIMSIT","SERGE"]
["131820A","TONINI BOSSI","LAURENT"]
["132786E","TONNELIER","JEAN PIERRE"]
["135554Q","TORES","JEAN LUC"]
["014256I","TOURE","MADOU"]
["139062O","TOUREILLE","ALAIN"]
["022441D","TOURET","THIERRY"]
["022443F","TRAN","KEVIN"]
["131929F","TRAN DINH","VUONG"]
["138277J","TRAPPE","JEAN MARIE"]
["022446I","TRIVINO","RENE"]
["107282G","VAHE","GUILLAUME"]
["139591X","VAN HACK","DIDIER"]
["022456S","VASCONE","JOHNY"]
["129880K","VASSE","JEAN PIERRE"]
["022459V","VAUTRIN","JEAN"]
["022466C","VIALATTE","ANDRE"]
["166670N","VIAN","MORGAN"]
["022467D","VIBOUREL","ETIENNE"]
["147412F","VICTOR","DANIEL"]
["148051A","VIERA MAIA","ARLINDO"]
["164317F","VILLARD","PATRICE"]
["101485H","VILLASEVIL","ANTONIO"]
["153007M","VILLEMAIN","SYLVAIN"]
["147607S","VIOU","GERARD"]
["138731V","VISCONTI","JEAN"]
["119674W","VITALIEN","PIERRE"]
["022476M","VIVALDI","ANDRE"]
["154571M","VUILLAUME","JEAN CLAUDE"]
["014349X","WEINER","GUY"]
["143308W","YORAC","ARNOLF"]
["166159H","YUNG","NADEGE"]
["134311V","ZANDRINO","ALAIN"]
["125457H","ZOPPI","CEDRIC"]
["144788U","ZOPPI","AIME"]

{"sheet":"Saisie des joueurs","index":4,"n_rows":51,"n_cols":22,"rows_kept":51,"cut":false,"hidden":false,"merged":[[50,2,50,3],[42,2,47,6],[10,3,10,4],[12,2,12,6],[14,2,14,6],[15,2,15,6],[33,8,36,8],[37,8,40,8],[21,8,24,8],[25,8,28,8],[29,8,32,8],[0,2,1,6],[2,2,2,6],[14,10,14,14],[4,4,8,6],[17,8,20,8],[15,10,15,14],[1,10,10,14]]}
[null,null,"LIGUE MEDITERRANEENNE DE BILLARD"]
[null,null,null,null,null,null,null,"Mis à jour le 28/02/2023",null,null,"Rappel de l'Article 6.2.09 du Code Sportif Carambole FFB...  Joueurs d'un même club.\n\"Pour toutes les poules, tous les joueurs d'un même club sont opposés les uns aux autres aux premiers tours de jeu\".\nIl arrive quelquefois, dans nos poules de 4 joueurs, que 3 joueurs soient d'un même club.\nLe bon sens est de ne pas laisser le seul joueur d'un autre club attendre que les trois premiers matchs se fassent sans lui.\n Dans ce cas, il suffit d'organiser les tours de jeu de telle sorte que\nle dernier match se fasse entre deux joueurs de clubs différents.\n"]
[null,null,"Saisir ici les informations concernant le tournoi."]
[]
[null,null,"Date  (jj/mm/aa)"]
[]
[null,null,"N° de la compétition"]
[]
[null,null,"Mode de jeu","LIBRE"]
[]
[null,null,"Club organisateur",null,null,"Directeur de jeu"]
[]
[null,null,"TOURNOI 4 A 24 JOUEURS - POULE UNIQUE DE 4 JOUEURS"]
[]
[null,null,"Dans cet onglet \"Saisir dans la liste déroulante les NOMS  des joueurs de cette Colonne\", l'ordre à saisir n'est pas important :\nMettre le joueur ABSENT sur les cases vides restantes, OU sur un joueur forfait au dernier moment,\n ensuite cliquer sur le \"BOUTON TRI \"",null,null,null,null,null,null,null,"RESULTAT DU TRI DES POULES"]
[null,null,"Ne pas toucher au cellules ci-dessous",null,null,null,null,null,null,null,"Ne pas toucher au cellules ci-dessous"]
["N°","Liste déroulante NOM ","N° Licence","NOM PRENOM","Catégorie","Moyenne 3,10","Club",null,null,null,"Licences","NOM PRENOM","Catégorie","Moyenne 3,10","Club",null,null,"Licences","NOMS","Catégorie","Moyenne sur 3,10","Club"]
[{"$f":"ROW(A1)","v":1},null,{"$f":"IF(B18<>\"\",VLOOKUP(B18,DONNEES!$B$4:$F$478,2,FALSE),\"\")","v":""},{"$f":"IF(B18<>\"\",VLOOKUP(B18,DONNEES!$B$4:$F$478,1,FALSE),\"\")","v":""},{"$f":"IF(B18<>\"\",VLOOKUP(B18,DONNEES!$B$4:$F$478,3,FALSE),\"x\")","v":"x"},{"$f":"IF(B18<>\"\",VLOOKUP(B18,DONNEES!$B$4:$F$478,4,FALSE),\"\")","v":""},{"$f":"IF(B18<>\"\",VLOOKUP(B18,DONNEES!$B$4:$F$478,5,FALSE),\"\")","v":""},null,null,null,"","","x","",""]
[{"$f":"ROW(A2)","v":2},null,{"$f":"IF(B19<>\"\",VLOOKUP(B19,DONNEES!$B$4:$F$478,2,FALSE),\"\")","v":""},{"$f":"IF(B19<>\"\",VLOOKUP(B19,DONNEES!$B$4:$F$478,1,FALSE),\"\")","v":""},{"$f":"IF(B19<>\"\",VLOOKUP(B19,DONNEES!$B$4:$F$478,3,FALSE),\"x\")","v":"x"},{"$f":"IF(B19<>\"\",VLOOKUP(B19,DONNEES!$B$4:$F$478,4,FALSE),\"\")","v":""},{"$f":"IF(B19<>\"\",VLOOKUP(B19,DONNEES!$B$4:$F$478,5,FALSE),\"\")","v":""},null,null,null,"","","x","",""]
[3,null,{"$f":"IF(B20<>\"\",VLOOKUP(B20,DONNEES!$B$4:$F$478,2,FALSE),\"\")","v":""},{"$f":"IF(B20<>\"\",VLOOKUP(B20,DONNEES!$B$4:$F$478,1,FALSE),\"\")","v":""},{"$f":"IF(B20<>\"\",VLOOKUP(B20,DONNEES!$B$4:$F$478,3,FALSE),\"x\")","v":"x"},{"$f":"IF(B20<>\"\",VLOOKUP(B20,DONNEES!$B$4:$F$478,4,FALSE),\"\")","v":""},{"$f":"IF(B20<>\"\",VLOOKUP(B20,DONNEES!$B$4:$F$478,5,FALSE),\"\")","v":""},null,null,null,"","","x","",""]
[4,null,{"$f":"IF(B21<>\"\",VLOOKUP(B21,DONNEES!$B$4:$F$478,2,FALSE),\"\")","v":""},{"$f":"IF(B21<>\"\",VLOOKUP(B21,DONNEES!$B$4:$F$478,1,FALSE),\"\")","v":""},{"$f":"IF(B21<>\"\",VLOOKUP(B21,DONNEES!$B$4:$F$478,3,FALSE),\"x\")","v":"x"},{"$f":"IF(B21<>\"\",VLOOKUP(B21,DONNEES!$B$4:$F$478,4,FALSE),\"\")","v":""},{"$f":"IF(B21<>\"\",VLOOKUP(B21,DONNEES!$B$4:$F$478,5,FALSE),\"\")","v":""},null,null,null,"","","x","",""]
[5,null,{"$f":"IF(B22<>\"\",VLOOKUP(B22,DONNEES!$B$4:$F$478,2,FALSE),\"\")","v":""},{"$f":"IF(B22<>\"\",VLOOKUP(B22,DONNEES!$B$4:$F$478,1,FALSE),\"\")","v":""},{"$f":"IF(B22<>\"\",VLOOKUP(B22,DONNEES!$B$4:$F$478,3,FALSE),\"x\")","v":"x"},{"$f":"IF(B22<>\"\",VLOOKUP(B22,DONNEES!$B$4:$F$478,4,FALSE),\"\")","v":""},{"$f":"IF(B22<>\"\",VLOOKUP(B22,DONNEES!$B$4:$F$478,5,FALSE),\"\")","v":""},null,null,null,"","","x","",""]
[6,null,{"$f":"IF(B23<>\"\",VLOOKUP(B23,DONNEES!$B$4:$F$478,2,FALSE),\"\")","v":""},{"$f":"IF(B23<>\"\",VLOOKUP(B23,DONNEES!$B$4:$F$478,1,FALSE),\"\")","v":""},{"$f":"IF(B23<>\"\",VLOOKUP(B23,DONNEES!$B$4:$F$478,3,FALSE),\"x\")","v":"x"},{"$f":"IF(B23<>\"\",VLOOKUP(B23,DONNEES!$B$4:$F$478,4,FALSE),\"\")","v":""},{"$f":"IF(B23<>\"\",VLOOKUP(B23,DONNEES!$B$4:$F$478,5,FALSE),\"\")","v":""},null,null,null,"","","x","",""]
[7,null,{"$f":"IF(B24<>\"\",VLOOKUP(B24,DONNEES!$B$4:$F$478,2,FALSE),\"\")","v":""},{"$f":"IF(B24<>\"\",VLOOKUP(B24,DONNEES!$B$4:$F$478,1,FALSE),\"\")","v":""},{"$f":"IF(B24<>\"\",VLOOKUP(B24,DONNEES!$B$4:$F$478,3,FALSE),\"x\")","v":"x"},{"$f":"IF(B24<>\"\",VLOOKUP(B24,DONNEES!$B$4:$F$478,4,FALSE),\"\")","v":""},{"$f":"IF(B24<>\"\",VLOOKUP(B24,DONNEES!$B$4:$F$478,5,FALSE),\"\")","v":""},null,null,null,"","","x","",""]
[8,null,{"$f":"IF(B25<>\"\",VLOOKUP(B25,DONNEES!$B$4:$F$478,2,FALSE),\"\")","v":""},{"$f":"IF(B25<>\"\",VLOOKUP(B25,DONNEES!$B$4:$F$478,1,FALSE),\"\")","v":""},{"$f":"IF(B25<>\"\",VLOOKUP(B25,DONNEES!$B$4:$F$478,3,FALSE),\"x\")","v":"x"},{"$f":"IF(B25<>\"\",VLOOKUP(B25,DONNEES!$B$4:$F$478,4,FALSE),\"\")","v":""},{"$f":"IF(B25<>\"\",VLOOKUP(B25,DONNEES!$B$4:$F$478,5,FALSE),\"\")","v":""},null,null,null,"","","x","",""]
[9,null,{"$f":"IF(B26<>\"\",VLOOKUP(B26,DONNEES!$B$4:$F$478,2,FALSE),\"\")","v":""},{"$f":"IF(B26<>\"\",VLOOKUP(B26,DONNEES!$B$4:$F$478,1,FALSE),\"\")","v":""},{"$f":"IF(B26<>\"\",VLOOKUP(B26,DONNEES!$B$4:$F$478,3,FALSE),\"x\")","v":"x"},{"$f":"IF(B26<>\"\",VLOOKUP(B26,DONNEES!$B$4:$F$478,4,FALSE),\"\")","v":""},{"$f":"IF(B26<>\"\",VLOOKUP(B26,DONNEES!$B$4:$F$478,5,FALSE),\"\")","v":""},null,null,null,"","","x","",""]
[10,null,{"$f":"IF(B27<>\"\",VLOOKUP(B27,DONNEES!$B$4:$F$478,2,FALSE),\"\")","v":""},{"$f":"IF(B27<>\"\",VLOOKUP(B27,DONNEES!$B$4:$F$478,1,FALSE),\"\")","v":""},{"$f":"IF(B27<>\"\",VLOOKUP(B27,DONNEES!$B$4:$F$478,3,FALSE),\"x\")","v":"x"},{"$f":"IF(B27<>\"\",VLOOKUP(B27,DONNEES!$B$4:$F$478,4,FALSE),\"\")","v":""},{"$f":"IF(B27<>\"\",VLOOKUP(B27,DONNEES!$B$4:$F$478,5,FALSE),\"\")","v":""},null,null,null,"","","x","",""]
[11,null,{"$f":"IF(B28<>\"\",VLOOKUP(B28,DONNEES!$B$4:$F$478,2,FALSE),\"\")","v":""},{"$f":"IF(B28<>\"\",VLOOKUP(B28,DONNEES!$B$4:$F$478,1,FALSE),\"\")","v":""},{"$f":"IF(B28<>\"\",VLOOKUP(B28,DONNEES!$B$4:$F$478,3,FALSE),\"x\")","v":"x"},{"$f":"IF(B28<>\"\",VLOOKUP(B28,DONNEES!$B$4:$F$478,4,FALSE),\"\")","v":""},{"$f":"IF(B28<>\"\",VLOOKUP(B28,DONNEES!$B$4:$F$478,5,FALSE),\"\")","v":""},null,null,null,"","","x","",""]
[12,null,{"$f":"IF(B29<>\"\",VLOOKUP(B29,DONNEES!$B$4:$F$478,2,FALSE),\"\")","v":""},{"$f":"IF(B29<>\"\",VLOOKUP(B29,DONNEES!$B$4:$F$478,1,FALSE),\"\")","v":""},{"$f":"IF(B29<>\"\",VLOOKUP(B29,DONNEES!$B$4:$F$478,3,FALSE),\"x\")","v":"x"},{"$f":"IF(B29<>\"\",VLOOKUP(B29,DONNEES!$B$4:$F$478,4,FALSE),\"\")","v":""},{"$f":"IF(B29<>\"\",VLOOKUP(B29,DONNEES!$B$4:$F$478,5,FALSE),\"\")","v":""},null,null,null,"","","x","",""]
[13,null,{"$f":"IF(B30<>\"\",VLOOKUP(B30,DONNEES!$B$4:$F$478,2,FALSE),\"\")","v":""},{"$f":"IF(B30<>\"\",VLOOKUP(B30,DONNEES!$B$4:$F$478,1,FALSE),\"\")","v":""},{"$f":"IF(B30<>\"\",VLOOKUP(B30,DONNEES!$B$4:$F$478,3,FALSE),\"x\")","v":"x"},{"$f":"IF(B30<>\"\",VLOOKUP(B30,DONNEES!$B$4:$F$478,4,FALSE),\"\")","v":""},{"$f":"IF(B30<>\"\",VLOOKUP(B30,DONNEES!$B$4:$F$478,5,FALSE),\"\")","v":""},null,null,null,"","","x","",""]
[14,null,{"$f":"IF(B31<>\"\",VLOOKUP(B31,DONNEES!$B$4:$F$478,2,FALSE),\"\")","v":""},{"$f":"IF(B31<>\"\",VLOOKUP(B31,DONNEES!$B$4:$F$478,1,FALSE),\"\")","v":""},{"$f":"IF(B31<>\"\",VLOOKUP(B31,DONNEES!$B$4:$F$478,3,FALSE),\"x\")","v":"x"},{"$f":"IF(B31<>\"\",VLOOKUP(B31,DONNEES!$B$4:$F$478,4,FALSE),\"\")","v":""},{"$f":"IF(B31<>\"\",VLOOKUP(B31,DONNEES!$B$4:$F$478,5,FALSE),\"\")","v":""},null,null,null,"","","x","",""]
[15,null,{"$f":"IF(B32<>\"\",VLOOKUP(B32,DONNEES!$B$4:$F$478,2,FALSE),\"\")","v":""},{"$f":"IF(B32<>\"\",VLOOKUP(B32,DONNEES!$B$4:$F$478,1,FALSE),\"\")","v":""},{"$f":"IF(B32<>\"\",VLOOKUP(B32,DONNEES!$B$4:$F$478,3,FALSE),\"x\")","v":"x"},{"$f":"IF(B32<>\"\",VLOOKUP(B32,DONNEES!$B$4:$F$478,4,FALSE),\"\")","v":""},{"$f":"IF(B32<>\"\",VLOOKUP(B32,DONNEES!$B$4:$F$478,5,FALSE),\"\")","v":""},null,null,null,"","","x","",""]
[16,null,{"$f":"IF(B33<>\"\",VLOOKUP(B33,DONNEES!$B$4:$F$478,2,FALSE),\"\")","v":""},{"$f":"IF(B33<>\"\",VLOOKUP(B33,DONNEES!$B$4:$F$478,1,FALSE),\"\")","v":""},{"$f":"IF(B33<>\"\",VLOOKUP(B33,DONNEES!$B$4:$F$478,3,FALSE),\"x\")","v":"x"},{"$f":"IF(B33<>\"\",VLOOKUP(B33,DONNEES!$B$4:$F$478,4,FALSE),\"\")","v":""},{"$f":"IF(B33<>\"\",VLOOKUP(B33,DONNEES!$B$4:$F$478,5,FALSE),\"\")","v":""},null,null,null,"","","x","",""]
[17,null,{"$f":"IF(B34<>\"\",VLOOKUP(B34,DONNEES!$B$4:$F$478,2,FALSE),\"\")","v":""},{"$f":"IF(B34<>\"\",VLOOKUP(B34,DONNEES!$B$4:$F$478,1,FALSE),\"\")","v":""},{"$f":"IF(B34<>\"\",VLOOKUP(B34,DONNEES!$B$4:$F$478,3,FALSE),\"x\")","v":"x"},{"$f":"IF(B34<>\"\",VLOOKUP(B34,DONNEES!$B$4:$F$478,4,FALSE),\"\")","v":""},{"$f":"IF(B34<>\"\",VLOOKUP(B34,DONNEES!$B$4:$F$478,5,FALSE),\"\")","v":""},null,null,null,"","","x","",""]
[18,null,{"$f":"IF(B35<>\"\",VLOOKUP(B35,DONNEES!$B$4:$F$478,2,FALSE),\"\")","v":""},{"$f":"IF(B35<>\"\",VLOOKUP(B35,DONNEES!$B$4:$F$478,1,FALSE),\"\")","v":""},{"$f":"IF(B35<>\"\",VLOOKUP(B35,DONNEES!$B$4:$F$478,3,FALSE),\"x\")","v":"x"},{"$f":"IF(B35<>\"\",VLOOKUP(B35,DONNEES!$B$4:$F$478,4,FALSE),\"\")","v":""},{"$f":"IF(B35<>\"\",VLOOKUP(B35,DONNEES!$B$4:$F$478,5,FALSE),\"\")","v":""},null,null,null,"","","x","",""]
[19,null,{"$f":"IF(B36<>\"\",VLOOKUP(B36,DONNEES!$B$4:$F$478,2,FALSE),\"\")","v":""},{"$f":"IF(B36<>\"\",VLOOKUP(B36,DONNEES!$B$4:$F$478,1,FALSE),\"\")","v":""},{"$f":"IF(B36<>\"\",VLOOKUP(B36,DONNEES!$B$4:$F$478,3,FALSE),\"x\")","v":"x"},{"$f":"IF(B36<>\"\",VLOOKUP(B36,DONNEES!$B$4:$F$478,4,FALSE),\"\")","v":""},{"$f":"IF(B36<>\"\",VLOOKUP(B36,DONNEES!$B$4:$F$478,5,FALSE),\"\")","v":""},null,null,null,"","","x","",""]
[20,null,{"$f":"IF(B37<>\"\",VLOOKUP(B37,DONNEES!$B$4:$F$478,2,FALSE),\"\")","v":""},{"$f":"IF(B37<>\"\",VLOOKUP(B37,DONNEES!$B$4:$F$478,1,FALSE),\"\")","v":""},{"$f":"IF(B37<>\"\",VLOOKUP(B37,DONNEES!$B$4:$F$478,3,FALSE),\"x\")","v":"x"},{"$f":"IF(B37<>\"\",VLOOKUP(B37,DONNEES!$B$4:$F$478,4,FALSE),\"\")","v":""},{"$f":"IF(B37<>\"\",VLOOKUP(B37,DONNEES!$B$4:$F$478,5,FALSE),\"\")","v":""},null,null,null,"","","x","",""]
[21,null,{"$f":"IF(B38<>\"\",VLOOKUP(B38,DONNEES!$B$4:$F$478,2,FALSE),\"\")","v":""},{"$f":"IF(B38<>\"\",VLOOKUP(B38,DONNEES!$B$4:$F$478,1,FALSE),\"\")","v":""},{"$f":"IF(B38<>\"\",VLOOKUP(B38,DONNEES!$B$4:$F$478,3,FALSE),\"x\")","v":"x"},{"$f":"IF(B38<>\"\",VLOOKUP(B38,DONNEES!$B$4:$F$478,4,FALSE),\"\")","v":""},{"$f":"IF(B38<>\"\",VLOOKUP(B38,DONNEES!$B$4:$F$478,5,FALSE),\"\")","v":""},null,null,null,"","","x","",""]
[22,null,{"$f":"IF(B39<>\"\",VLOOKUP(B39,DONNEES!$B$4:$F$478,2,FALSE),\"\")","v":""},{"$f":"IF(B39<>\"\",VLOOKUP(B39,DONNEES!$B$4:$F$478,1,FALSE),\"\")","v":""},{"$f":"IF(B39<>\"\",VLOOKUP(B39,DONNEES!$B$4:$F$478,3,FALSE),\"x\")","v":"x"},{"$f":"IF(B39<>\"\",VLOOKUP(B39,DONNEES!$B$4:$F$478,4,FALSE),\"\")","v":""},{"$f":"IF(B39<>\"\",VLOOKUP(B39,DONNEES!$B$4:$F$478,5,FALSE),\"\")","v":""},null,null,null,"","","x","",""]
[23,null,{"$f":"IF(B40<>\"\",VLOOKUP(B40,DONNEES!$B$4:$F$478,2,FALSE),\"\")","v":""},{"$f":"IF(B40<>\"\",VLOOKUP(B40,DONNEES!$B$4:$F$478,1,FALSE),\"\")","v":""},{"$f":"IF(B40<>\"\",VLOOKUP(B40,DONNEES!$B$4:$F$478,3,FALSE),\"x\")","v":"x"},{"$f":"IF(B40<>\"\",VLOOKUP(B40,DONNEES!$B$4:$F$478,4,FALSE),\"\")","v":""},{"$f":"IF(B40<>\"\",VLOOKUP(B40,DONNEES!$B$4:$F$478,5,FALSE),\"\")","v":""},null,null,null,"","","x","",""]
[24,null,{"$f":"IF(B41<>\"\",VLOOKUP(B41,DONNEES!$B$4:$F$478,2,FALSE),\"\")","v":""},{"$f":"IF(B41<>\"\",VLOOKUP(B41,DONNEES!$B$4:$F$478,1,FALSE),\"\")","v":""},{"$f":"IF(B41<>\"\",VLOOKUP(B41,DONNEES!$B$4:$F$478,3,FALSE),\"x\")","v":"x"},{"$f":"IF(B41<>\"\",VLOOKUP(B41,DONNEES!$B$4:$F$478,4,FALSE),\"\")","v":""},{"$f":"IF(B41<>\"\",VLOOKUP(B41,DONNEES!$B$4:$F$478,5,FALSE),\"\")","v":""},null,null,null,"","","x","",""]
[]
[null,null,"1) Saisir uniquement les NOMS A SAISIR Colonne B des JOUEURS. \n2) Activer les macros dans la barre au dessus \"Avertissement de sécurité - Les macros ont été désactivées\".\nCliquer sur \"Options...\" et \"Activer ce contenu\" puis \"OK\" sans tenir compte de l'avertissement.\n3) Puis appuyez sur le \"Bouton de Tri\". Le tableau de droite donne le résultat du tri et chaque onglet \"billard 1 à 6\" reçoit les joueurs.\nCe graphique permet de préparer des tournois de 4 à 24 joueurs, en fonction du nombre d'inscrits."]
[]
[]
[]
[]
[]
[]
[]
[null,null,"™A.FERHAT ™ C.PEREZ"]

{"sheet":"BILLARD 1","index":5,"n_rows":53,"n_cols":42,"rows_kept":53,"cut":false,"hidden":false,"merged":[[1,1,3,6],[25,31,27,31],[25,30,27,30],[25,32,27,32],[25,33,27,33],[25,34,27,34],[25,41,27,41],[19,41,21,41],[19,40,21,40],[22,41,24,41],[22,40,24,40],[25,40,27,40],[25,38,27,38],[25,39,27,39],[19,39,21,39],[22,39,24,39],[22,37,24,37],[22,38,24,38],[25,35,27,35],[1,7,3,9],[1,10,3,13],[12,1,13,5],[13,10,15,11],[16,12,18,14],[52,1,52,2],[34,1,35,1],[34,4,35,4],[25,28,27,28],[25,10,27,11],[38,7,39,10],[36,7,37,10],[29,12,29,23],[31,1,32,1],[31,4,32,4],[28,1,29,1],[28,4,29,4],[25,21,27,23],[50,1,50,10],[43,1,43,10],[44,1,44,10],[45,1,45,10],[46,1,46,10],[47,1,47,10],[48,1,48,10],[49,1,49,10],[41,1,42,10],[38,1,39,1],[31,12,33,23],[38,2,39,2],[25,1,26,1],[25,4,26,4],[22,1,23,1],[22,4,23,4],[19,1,20,1],[19,4,20,4],[6,2,6,5],[7,2,7,5],[8,2,8,5],[9,2,9,5],[38,3,39,5],[19,15,21,17],[22,18,24,20],[12,12,15,14],[12,15,15,17],[12,18,15,20],[12,21,15,23],[15,2,16,5],[13,28,15,28],[16,10,18,11],[19,10,21,11],[22,10,24,11],[16,28,18,28],[19,28,21,28],[22,28,24,28],[13,25,15,27],[19,33,21,33],[19,32,21,32],[19,31,21,31],[19,30,21,30],[14,30,14,31],[16,30,18,30],[16,31,18,31],[22,33,24,33],[22,34,24,34],[22,30,24,30],[22,31,24,31],[22,32,24,32],[22,36,24,36],[25,36,27,36],[25,37,27,37],[22,35,24,35],[14,41,15,41],[16,41,18,41],[16,40,18,40],[14,32,14,33],[14,34,14,35],[14,36,14,37],[16,36,18,36],[19,36,21,36],[14,38,14,39],[16,32,18,32],[16,33,18,33],[16,34,18,34],[16,35,18,35],[16,39,18,39],[16,37,18,37],[19,37,21,37],[19,38,21,38],[16,38,18,38],[19,35,21,35],[19,34,21,34]]}
[]
[null,{"$f":"'Saisie des joueurs'!C1","v":"LIGUE MEDITERRANEENNE DE BILLARD"},null,null,null,null,null,{"$f":"'Saisie des joueurs'!D7","v":0},null,null,{"$f":"'Saisie des joueurs'!D9","v":"LIBRE"}]
[]
[]
[]
[]
[null,"Joueur 1",{"$f":"'Saisie des joueurs'!L18","v":""}]
[null,"Joueur 2",{"$f":"'Saisie des joueurs'!L19","v":""}]
[null,"Joueur 3",{"$f":"'Saisie des joueurs'!L20","v":""}]
[null,"Joueur 4",{"$f":"'Saisie des joueurs'!L21","v":""}]
[]
[]
[null,"SAISIE DES RESULTATS",null,null,null,null,null,null,null,null,null,null,{"$f":"C7","v":""},null,null,{"$f":"C8","v":""},null,null,{"$f":"C9","v":""},null,null,{"$f":"C10","v":""}]
[null,null,null,null,null,null,null,null,null,null,null,null,null,null,null,null,null,null,null,null,null,null,null,null,null,"TOTAUX",null,null,"CLASSEMENT"]
[null,null,null,null,null,null,null,null,null,null,null,null,null,null,null,null,null,null,null,null,null,null,null,null,null,null,null,null,null,null,"Classement",null,"Classement",null,"Classement",null,"Classement",null,"Classement",null,"GENERAL","RANG"]
[null,null,"BILLARD 1",null,null,null,null,null,null,null,null,null,null,null,null,null,null,null,null,null,null,null,null,null,null,null,null,null,null,null,"Point-Match","CLS-M","Moy-Gen","CLS-G","Moy-Part","CLS-P","M-Series","CLS-S","MGPS","CLS","CLS"]
[null,null,null,null,null,null,null,null,null,null,{"$f":"C7","v":""},null,"L",null,null,{"$f":"D32","v":0},null,{"$f":"E32","v":0},{"$f":"D26","v":0},null,{"$f":"E26","v":0},{"$f":"D20","v":0},null,{"$f":"E20","v":0},null,{"$f":"P17+S17+V17","v":0},null,{"$f":"R17+U17+X17","v":0},{"$f":"AP17","v":{"$error":"#DIV/0!"}},null,{"$f":"AA18","v":0.03},{"$f":"RANK(AE17,AE$17:AE$28,0)","v":1},{"$f":"AB19","v":{"$error":"#DIV/0!"}},{"$f":"RANK(AG17,AG$17:AG$28,0)","v":{"$error":"#DIV/0!"}},{"$f":"MAX(R19,U19,X19)","v":{"$error":"#DIV/0!"}},{"$f":"RANK(AI17,AI$17:AI$28)","v":{"$error":"#DIV/0!"}},{"$f":"Z19","v":0},{"$f":"RANK(AK17,AK$17:AK$28)","v":1},{"$f":"(AF17*1000)+(AH17*100)+(AJ17*10)+(AL17*1)","v":{"$error":"#DIV/0!"}},{"$f":"AM17","v":{"$error":"#DIV/0!"}},{"$f":"RANK(AN17,AN$17:AN$28,1)","v":{"$error":"#DIV/0!"}},{"$f":"RANK(AO17,AO$17:AO$28,1)","v":{"$error":"#DIV/0!"}}]
[null,null,null,null,null,null,null,null,null,null,null,null,null,null,null,null,{"$f":"IF(R17<1,0.01,IF(P17>M20,2,IF(P17=M20,1,0)))","v":0.01},null,null,{"$f":"IF(U17<1,0.01,IF(S17>M23,2,IF(S17=M23,1,0)))","v":0.01},null,null,{"$f":"IF(X17<1,0.01,IF(V17>M26,2,IF(V17=M26,1,0)))","v":0.01},null,null,null,{"$f":"Q18+T18+W18","v":0.03}]
[null,null,null,"Pts","Rep","Série",null,null,null,null,null,null,null,null,null,{"$f":"F32","v":0},null,{"$f":"P17/R17","v":{"$error":"#DIV/0!"}},{"$f":"F26","v":0},null,{"$f":"S17/U17","v":{"$error":"#DIV/0!"}},{"$f":"F20","v":0},null,{"$f":"V17/X17","v":{"$error":"#DIV/0!"}},null,{"$f":"MAX(P19,S19,V19)","v":0},null,{"$f":"Z17/AB17","v":{"$error":"#DIV/0!"}}]
[null,"Tour 1",{"$f":"C7","v":""},null,null,null,null,null,null,null,{"$f":"C8","v":""},null,{"$f":"D33","v":0},null,{"$f":"E32","v":0},"M",null,null,{"$f":"D23","v":0},null,{"$f":"E23","v":0},{"$f":"D30","v":0},null,{"$f":"E29","v":0},null,{"$f":"M20+S20+V20","v":0},null,{"$f":"O20+U20+X20","v":0},{"$f":"AP20","v":{"$error":"#DIV/0!"}},null,{"$f":"AA21","v":0.03},{"$f":"RANK(AE20,AE$17:AE$28,0)","v":1},{"$f":"AB22","v":{"$error":"#DIV/0!"}},{"$f":"RANK(AG20,AG$17:AG$28,0)","v":{"$error":"#DIV/0!"}},{"$f":"MAX(O22,U22,X22)","v":{"$error":"#DIV/0!"}},{"$f":"RANK(AI20,AI$17:AI$28)","v":{"$error":"#DIV/0!"}},{"$f":"Z22","v":0},{"$f":"RANK(AK20,AK$17:AK$28)","v":1},{"$f":"(AF20*1000)+(AH20*100)+(AJ20*10)+(AL20*1)","v":{"$error":"#DIV/0!"}},{"$f":"AM20","v":{"$error":"#DIV/0!"}},{"$f":"RANK(AN20,AN$17:AN$28,1)","v":{"$error":"#DIV/0!"}},{"$f":"RANK(AO20,AO$17:AO$28,1)","v":{"$error":"#DIV/0!"}}]
[null,null,{"$f":"C10","v":""},null,null,null,null,null,null,null,null,null,null,{"$f":"IF(R17>0,2-Q18,0.01)","v":0.01},null,null,null,null,null,{"$f":"IF(U20<1,0.01,IF(S20>P23,2,IF(S20=P23,1,0)))","v":0.01},null,null,{"$f":"IF(X20<1,0.01,IF(V20>P26,2,IF(V20=P26,1,0)))","v":0.01},null,null,null,{"$f":"N21+T21+W21","v":0.03}]
[null,null,null,null,null,null,null,null,null,null,null,null,{"$f":"F33","v":0},null,{"$f":"M20/O20","v":{"$error":"#DIV/0!"}},null,null,null,{"$f":"F23","v":0},null,{"$f":"S20/U20","v":{"$error":"#DIV/0!"}},{"$f":"F30","v":0},null,{"$f":"V20/X20","v":{"$error":"#DIV/0!"}},null,{"$f":"MAXA(M22,S22,V22)","v":0},null,{"$f":"Z20/AB20","v":{"$error":"#DIV/0!"}}]
[null,"Tour 2",{"$f":"C8","v":""},null,null,null,null,null,null,null,{"$f":"C9","v":""},null,{"$f":"D27","v":0},null,{"$f":"E26","v":0},{"$f":"D24","v":0},null,{"$f":"E23","v":0},"B",null,null,{"$f":"D35","v":0},null,{"$f":"E35","v":0},null,{"$f":"M23+P23+V23","v":0},null,{"$f":"O23+R23+X23","v":0},{"$f":"AP23","v":{"$error":"#DIV/0!"}},null,{"$f":"AA24","v":0.03},{"$f":"RANK(AE23,AE$17:AE$28,0)","v":1},{"$f":"AB25","v":{"$error":"#DIV/0!"}},{"$f":"RANK(AG23,AG$17:AG$28,0)","v":{"$error":"#DIV/0!"}},{"$f":"MAX(O25,R25,X25)","v":{"$error":"#DIV/0!"}},{"$f":"RANK(AI23,AI$17:AI$28)","v":{"$error":"#DIV/0!"}},{"$f":"Z25","v":0},{"$f":"RANK(AK23,AK$17:AK$28)","v":1},{"$f":"(AF23*1000)+(AH23*100)+(AJ23*10)+(AL23*1)","v":{"$error":"#DIV/0!"}},{"$f":"AM23","v":{"$error":"#DIV/0!"}},{"$f":"RANK(AN23,AN$17:AN$28,1)","v":{"$error":"#DIV/0!"}},{"$f":"RANK(AO23,AO$17:AO$28,1)","v":{"$error":"#DIV/0!"}}]
[null,null,{"$f":"C9","v":""},null,null,null,null,null,null,null,null,null,null,{"$f":"IF(U17>0,2-T18,0.01)","v":0.01},null,null,{"$f":"IF(U20>0,2-T21,0.01)","v":0.01},null,null,null,null,null,{"$f":"IF(X23<1,0.01,IF(V23>S26,2,IF(V23=S26,1,0)))","v":0.01},null,null,null,{"$f":"N24+Q24+W24","v":0.03}]
[null,null,null,null,null,null,null,null,null,null,null,null,{"$f":"F27","v":0},null,{"$f":"M23/O23","v":{"$error":"#DIV/0!"}},{"$f":"F24","v":0},null,{"$f":"P23/R23","v":{"$error":"#DIV/0!"}},null,null,null,{"$f":"F35","v":0},null,{"$f":"V23/X23","v":{"$error":"#DIV/0!"}},null,{"$f":"MAXA(M25,P25,V25)","v":0},null,{"$f":"Z23/AB23","v":{"$error":"#DIV/0!"}}]
[null,"Tour 3",{"$f":"C7","v":""},null,null,null,null,null,null,null,{"$f":"C10","v":""},null,{"$f":"D21","v":0},null,{"$f":"E20","v":0},{"$f":"D29","v":0},null,{"$f":"E29","v":0},{"$f":"D36","v":0},null,{"$f":"E35","v":0},null,null,null,null,{"$f":"M26+P26+S26","v":0},null,{"$f":"O26+R26+U26","v":0},{"$f":"AP26","v":{"$error":"#DIV/0!"}},null,{"$f":"AA27","v":0.03},{"$f":"RANK(AE26,AE$17:AE$28,0)","v":1},{"$f":"AB28","v":{"$error":"#DIV/0!"}},{"$f":"RANK(AG26,AG$17:AG$28,0)","v":{"$error":"#DIV/0!"}},{"$f":"MAX(O28,R28,U28)","v":{"$error":"#DIV/0!"}},{"$f":"RANK(AI26,AI$17:AI$28)","v":{"$error":"#DIV/0!"}},{"$f":"Z28","v":0},{"$f":"RANK(AK26,AK$17:AK$28)","v":1},{"$f":"(AF26*1000)+(AH26*100)+(AJ26*10)+(AL26*1)","v":{"$error":"#DIV/0!"}},{"$f":"AM26","v":{"$error":"#DIV/0!"}},{"$f":"RANK(AN26,AN$17:AN$28,1)","v":{"$error":"#DIV/0!"}},{"$f":"RANK(AO26,AO$17:AO$28,1)","v":{"$error":"#DIV/0!"}}]
[null,null,{"$f":"C9","v":""},null,null,null,null,null,null,null,null,null,null,{"$f":"IF(X17>0,2-W18,0.01)","v":0.01},null,null,{"$f":"IF(X20>0,2-W21,0.01)","v":0.01},null,null,{"$f":"IF(X23>0,2-W24,0.01)","v":0.01},null,null,null,null,null,null,{"$f":"N27+Q27+T27","v":0.03}]
[null,null,null,null,null,null,null,null,null,null,null,null,{"$f":"F21","v":0},null,{"$f":"M26/O26","v":{"$error":"#DIV/0!"}},{"$f":"F29","v":0},null,{"$f":"P26/R26","v":{"$error":"#DIV/0!"}},{"$f":"F36","v":0},null,{"$f":"S26/U26","v":{"$error":"#DIV/0!"}},null,null,null,null,{"$f":"MAXA(M28,P28,S28)","v":0},null,{"$f":"Z26/AB26","v":{"$error":"#DIV/0!"}}]
[null,"Tour 4",{"$f":"C10","v":""}]
[null,null,{"$f":"C8","v":""},null,null,null,null,null,null,null,null,null,"Pas de prolongation en cas de match nul."]
[]
[null,"Tour 5",{"$f":"C7","v":""},null,null,null,null,null,null,null,null,null,"PRECISION CONCERNANT LA LIBRE :\nRemise sur mouches obligatoire en cas de contact lorqu'un N1 ou un Master est dans la partie."]
[null,null,{"$f":"C8","v":""}]
[]
[null,"Tour 6",{"$f":"C9","v":""}]
[null,null,{"$f":"C10","v":""}]
[null,null,null,null,null,null,null,"DIRECTEUR DE JEU :"]
[]
[null,"DATE : ",{"$f":"'Saisie des joueurs'!D5","v":"00:00:00"},null,null,null,null,{"$f":"'Saisie des joueurs'!G11","v":0}]
[]
[]
[null,"OBSERVATIONS"]
[]
[]
[]
[]
[]
[]
[]
[]
[]
[]
[null,"™A.FERHAT ™ C.PEREZ"]

{"sheet":"BILLARD 2","index":6,"n_rows":53,"n_cols":42,"rows_kept":53,"cut":false,"hidden":false,"merged":[[31,12,33,23],[9,2,9,5],[12,1,13,5],[12,12,15,14],[12,15,15,17],[12,18,15,20],[12,21,15,23],[1,7,3,9],[1,10,3,13],[6,2,6,5],[7,2,7,5],[8,2,8,5],[1,1,3,6],[19,15,21,17],[14,41,15,41],[15,2,16,5],[16,10,18,11],[16,12,18,14],[16,28,18,28],[16,30,18,30],[16,31,18,31],[16,32,18,32],[16,33,18,33],[13,25,15,27],[13,28,15,28],[14,30,14,31],[14,32,14,33],[14,34,14,35],[14,36,14,37],[16,40,18,40],[16,41,18,41],[16,35,18,35],[16,36,18,36],[16,37,18,37],[16,38,18,38],[16,39,18,39],[19,30,21,30],[19,31,21,31],[19,32,21,32],[22,32,24,32],[22,33,24,33],[22,34,24,34],[16,34,18,34],[19,39,21,39],[14,38,14,39],[19,40,21,40],[19,41,21,41],[22,1,23,1],[22,4,23,4],[22,10,24,11],[22,18,24,20],[22,28,24,28],[22,30,24,30],[22,31,24,31],[19,33,21,33],[19,34,21,34],[19,35,21,35],[19,36,21,36],[19,37,21,37],[19,38,21,38],[22,38,24,38],[22,39,24,39],[22,40,24,40],[22,41,24,41],[22,35,24,35],[22,36,24,36],[22,37,24,37],[19,1,20,1],[19,28,21,28],[25,37,27,37],[25,38,27,38],[25,39,27,39],[25,40,27,40],[25,41,27,41],[28,1,29,1],[28,4,29,4],[29,12,29,23],[25,31,27,31],[25,32,27,32],[25,33,27,33],[25,34,27,34],[25,35,27,35],[25,36,27,36],[25,1,26,1],[25,4,26,4],[25,10,27,11],[25,21,27,23],[25,28,27,28],[25,30,27,30],[48,1,48,10],[49,1,49,10],[50,1,50,10],[52,1,52,2],[12,10,15,11],[41,1,42,10],[43,1,43,10],[44,1,44,10],[45,1,45,10],[46,1,46,10],[47,1,47,10],[31,1,32,1],[31,4,32,4],[34,1,35,1],[34,4,35,4],[36,7,37,10],[38,1,39,1],[38,2,39,2],[38,3,39,5],[38,7,39,10],[19,4,20,4],[19,10,21,11]]}
[]
[null,{"$f":"'Saisie des joueurs'!C1","v":"LIGUE MEDITERRANEENNE DE BILLARD"},null,null,null,null,null,{"$f":"'Saisie des joueurs'!D7","v":0},null,null,{"$f":"'Saisie des joueurs'!D9","v":"LIBRE"}]
[]
[]
[]
[]
[null,"Joueur 1",{"$f":"'Saisie des joueurs'!L22","v":""}]
[null,"Joueur 2",{"$f":"'Saisie des joueurs'!L23","v":""}]
[null,"Joueur 3",{"$f":"'Saisie des joueurs'!L24","v":""}]
[null,"Joueur 4",{"$f":"'Saisie des joueurs'!L25","v":""}]
[]
[]
[null,"SAISIE DES RESULTATS",null,null,null,null,null,null,null,null,null,null,{"$f":"C7","v":""},null,null,{"$f":"C8","v":""},null,null,{"$f":"C9","v":""},null,null,{"$f":"C10","v":""}]
[null,null,null,null,null,null,null,null,null,null,null,null,null,null,null,null,null,null,null,null,null,null,null,null,null,"TOTAUX",null,null,"CLASSEMENT"]
[null,null,null,null,null,null,null,null,null,null,null,null,null,null,null,null,null,null,null,null,null,null,null,null,null,null,null,null,null,null,"Classement",null,"Classement",null,"Classement",null,"Classement",null,"Classement",null,"GENERAL","RANG"]
[null,null,"BILLARD 2",null,null,null,null,null,null,null,null,null,null,null,null,null,null,null,null,null,null,null,null,null,null,null,null,null,null,null,"Point-Match","CLS-M","Moy-Gen","CLS-G","Moy-Part","CLS-P","M-Series","CLS-S","MGPS","CLS","CLS"]
[null,null,null,null,null,null,null,null,null,null,{"$f":"C7","v":""},null,"L",null,null,{"$f":"D32","v":0},null,{"$f":"E32","v":0},{"$f":"D26","v":0},null,{"$f":"E26","v":0},{"$f":"D20","v":0},null,{"$f":"E20","v":0},null,{"$f":"P17+S17+V17","v":0},null,{"$f":"R17+U17+X17","v":0},{"$f":"AP17","v":{"$error":"#DIV/0!"}},null,{"$f":"AA18","v":0.03},{"$f":"RANK(AE17,AE$17:AE$28,0)","v":1},{"$f":"AB19","v":{"$error":"#DIV/0!"}},{"$f":"RANK(AG17,AG$17:AG$28,0)","v":{"$error":"#DIV/0!"}},{"$f":"MAX(R19,U19,X19)","v":{"$error":"#DIV/0!"}},{"$f":"RANK(AI17,AI$17:AI$28)","v":{"$error":"#DIV/0!"}},{"$f":"Z19","v":0},{"$f":"RANK(AK17,AK$17:AK$28)","v":1},{"$f":"(AF17*1000)+(AH17*100)+(AJ17*10)+(AL17*1)","v":{"$error":"#DIV/0!"}},{"$f":"AM17","v":{"$error":"#DIV/0!"}},{"$f":"RANK(AN17,AN$17:AN$28,1)","v":{"$error":"#DIV/0!"}},{"$f":"RANK(AO17,AO$17:AO$28,1)","v":{"$error":"#DIV/0!"}}]
[null,null,null,null,null,null,null,null,null,null,null,null,null,null,null,null,{"$f":"IF(R17<1,0.01,IF(P17>M20,2,IF(P17=M20,1,0)))","v":0.01},null,null,{"$f":"IF(U17<1,0.01,IF(S17>M23,2,IF(S17=M23,1,0)))","v":0.01},null,null,{"$f":"IF(X17<1,0.01,IF(V17>M26,2,IF(V17=M26,1,0)))","v":0.01},null,null,null,{"$f":"Q18+T18+W18","v":0.03}]
[null,null,null,"Pts","Rep","Série",null,null,null,null,null,null,null,null,null,{"$f":"F32","v":0},null,{"$f":"P17/R17","v":{"$error":"#DIV/0!"}},{"$f":"F26","v":0},null,{"$f":"S17/U17","v":{"$error":"#DIV/0!"}},{"$f":"F20","v":0},null,{"$f":"V17/X17","v":{"$error":"#DIV/0!"}},null,{"$f":"MAX(P19,S19,V19)","v":0},null,{"$f":"Z17/AB17","v":{"$error":"#DIV/0!"}}]
[null,"Tour 1",{"$f":"C7","v":""},null,null,null,null,null,null,null,{"$f":"C8","v":""},null,{"$f":"D33","v":0},null,{"$f":"E32","v":0},"M",null,null,{"$f":"D23","v":0},null,{"$f":"E23","v":0},{"$f":"D30","v":0},null,{"$f":"E29","v":0},null,{"$f":"M20+S20+V20","v":0},null,{"$f":"O20+U20+X20","v":0},{"$f":"AP20","v":{"$error":"#DIV/0!"}},null,{"$f":"AA21","v":0.03},{"$f":"RANK(AE20,AE$17:AE$28,0)","v":1},{"$f":"AB22","v":{"$error":"#DIV/0!"}},{"$f":"RANK(AG20,AG$17:AG$28,0)","v":{"$error":"#DIV/0!"}},{"$f":"MAX(O22,U22,X22)","v":{"$error":"#DIV/0!"}},{"$f":"RANK(AI20,AI$17:AI$28)","v":{"$error":"#DIV/0!"}},{"$f":"Z22","v":0},{"$f":"RANK(AK20,AK$17:AK$28)","v":1},{"$f":"(AF20*1000)+(AH20*100)+(AJ20*10)+(AL20*1)","v":{"$error":"#DIV/0!"}},{"$f":"AM20","v":{"$error":"#DIV/0!"}},{"$f":"RANK(AN20,AN$17:AN$28,1)","v":{"$error":"#DIV/0!"}},{"$error":"#DIV/0!"}]
[null,null,{"$f":"C10","v":""},null,null,null,null,null,null,null,null,null,null,{"$f":"IF(R17>0,2-Q18,0.01)","v":0.01},null,null,null,null,null,{"$f":"IF(U20<1,0.01,IF(S20>P23,2,IF(S20=P23,1,0)))","v":0.01},null,null,{"$f":"IF(X20<1,0.01,IF(V20>P26,2,IF(V20=P26,1,0)))","v":0.01},null,null,null,{"$f":"N21+T21+W21","v":0.03}]
[null,null,null,null,null,null,null,null,null,null,null,null,{"$f":"F33","v":0},null,{"$f":"M20/O20","v":{"$error":"#DIV/0!"}},null,null,null,{"$f":"F23","v":0},null,{"$f":"S20/U20","v":{"$error":"#DIV/0!"}},{"$f":"F30","v":0},null,{"$f":"V20/X20","v":{"$error":"#DIV/0!"}},null,{"$f":"MAXA(M22,S22,V22)","v":0},null,{"$f":"Z20/AB20","v":{"$error":"#DIV/0!"}}]
[null,"Tour 2",{"$f":"C8","v":""},null,null,null,null,null,null,null,{"$f":"C9","v":""},null,{"$f":"D27","v":0},null,{"$f":"E26","v":0},{"$f":"D24","v":0},null,{"$f":"E23","v":0},"B",null,null,{"$f":"D35","v":0},null,{"$f":"E35","v":0},null,{"$f":"M23+P23+V23","v":0},null,{"$f":"O23+R23+X23","v":0},{"$f":"AP23","v":{"$error":"#DIV/0!"}},null,{"$f":"AA24","v":0.03},{"$f":"RANK(AE23,AE$17:AE$28,0)","v":1},{"$f":"AB25","v":{"$error":"#DIV/0!"}},{"$f":"RANK(AG23,AG$17:AG$28,0)","v":{"$error":"#DIV/0!"}},{"$f":"MAX(O25,R25,X25)","v":{"$error":"#DIV/0!"}},{"$f":"RANK(AI23,AI$17:AI$28)","v":{"$error":"#DIV/0!"}},{"$f":"Z25","v":0},{"$f":"RANK(AK23,AK$17:AK$28)","v":1},{"$f":"(AF23*1000)+(AH23*100)+(AJ23*10)+(AL23*1)","v":{"$error":"#DIV/0!"}},{"$f":"AM23","v":{"$error":"#DIV/0!"}},{"$f":"RANK(AN23,AN$17:AN$28,1)","v":{"$error":"#DIV/0!"}},{"$error":"#DIV/0!"}]
[null,null,{"$f":"C9","v":""},null,null,null,null,null,null,null,null,null,null,{"$f":"IF(U17>0,2-T18,0.01)","v":0.01},null,null,{"$f":"IF(U20>0,2-T21,0.01)","v":0.01},null,null,null,null,null,{"$f":"IF(X23<1,0.01,IF(V23>S26,2,IF(V23=S26,1,0)))","v":0.01},null,null,null,{"$f":"N24+Q24+W24","v":0.03}]
[null,null,null,null,null,null,null,null,null,null,null,null,{"$f":"F27","v":0},null,{"$f":"M23/O23","v":{"$error":"#DIV/0!"}},{"$f":"F24","v":0},null,{"$f":"P23/R23","v":{"$error":"#DIV/0!"}},null,null,null,{"$f":"F35","v":0},null,{"$f":"V23/X23","v":{"$error":"#DIV/0!"}},null,{"$f":"MAXA(M25,P25,V25)","v":0},null,{"$f":"Z23/AB23","v":{"$error":"#DIV/0!"}}]
[null,"Tour 3",{"$f":"C7","v":""},null,null,null,null,null,null,null,{"$f":"C10","v":""},null,{"$f":"D21","v":0},null,{"$f":"E20","v":0},{"$f":"D29","v":0},null,{"$f":"E29","v":0},{"$f":"D36","v":0},null,{"$f":"E35","v":0},null,null,null,null,{"$f":"M26+P26+S26","v":0},null,{"$f":"O26+R26+U26","v":0},{"$f":"AP26","v":{"$error":"#DIV/0!"}},null,{"$f":"AA27","v":0.03},{"$f":"RANK(AE26,AE$17:AE$28,0)","v":1},{"$f":"AB28","v":{"$error":"#DIV/0!"}},{"$f":"RANK(AG26,AG$17:AG$28,0)","v":{"$error":"#DIV/0!"}},{"$f":"MAX(O28,R28,U28)","v":{"$error":"#DIV/0!"}},{"$f":"RANK(AI26,AI$17:AI$28)","v":{"$error":"#DIV/0!"}},{"$f":"Z28","v":0},{"$f":"RANK(AK26,AK$17:AK$28)","v":1},{"$f":"(AF26*1000)+(AH26*100)+(AJ26*10)+(AL26*1)","v":{"$error":"#DIV/0!"}},{"$f":"AM26","v":{"$error":"#DIV/0!"}},{"$f":"RANK(AN26,AN$17:AN$28,1)","v":{"$error":"#DIV/0!"}},{"$error":"#DIV/0!"}]
[null,null,{"$f":"C9","v":""},null,null,null,null,null,null,null,null,null,null,{"$f":"IF(X17>0,2-W18,0.01)","v":0.01},null,null,{"$f":"IF(X20>0,2-W21,0.01)","v":0.01},null,null,{"$f":"IF(X23>0,2-W24,0.01)","v":0.01},null,null,null,null,null,null,{"$f":"N27+Q27+T27","v":0.03}]
[null,null,null,null,null,null,null,null,null,null,null,null,{"$f":"F21","v":0},null,{"$f":"M26/O26","v":{"$error":"#DIV/0!"}},{"$f":"F29","v":0},null,{"$f":"P26/R26","v":{"$error":"#DIV/0!"}},{"$f":"F36","v":0},null,{"$f":"S26/U26","v":{"$error":"#DIV/0!"}},null,null,null,null,{"$f":"MAXA(M28,P28,S28)","v":0},null,{"$f":"Z26/AB26","v":{"$error":"#DIV/0!"}}]
[null,"Tour 4",{"$f":"C10","v":""}]
[null,null,{"$f":"C8","v":""},null,null,null,null,null,null,null,null,null,"Pas de prolongation en cas de match nul."]
[]
[null,"Tour 5",{"$f":"C7","v":""},null,null,null,null,null,null,null,null,null,"PRECISION CONCERNANT LA LIBRE :\nRemise sur mouches obligatoire en cas de contact lorqu'un N1 ou un Master est dans la partie."]
[null,null,{"$f":"C8","v":""}]
[]
[null,"Tour 6",{"$f":"C9","v":""}]
[null,null,{"$f":"C10","v":""}]
[null,null,null,null,null,null,null,"DIRECTEUR DE JEU :"]
[]
[null,"DATE : ",{"$f":"'Saisie des joueurs'!D5","v":"00:00:00"},null,null,null,null,{"$f":"'Saisie des joueurs'!G11","v":0}]
[]
[]
[null,"OBSERVATIONS"]
[]
[]
[]
[]
[]
[]
[]
[]
[]
[]
[null,"™A.FERHAT ™ C.PEREZ"]

{"sheet":"BILLARD 3","index":7,"n_rows":53,"n_cols":42,"rows_kept":53,"cut":false,"hidden":false,"merged":[[31,12,33,23],[9,2,9,5],[12,1,13,5],[12,12,15,14],[12,15,15,17],[12,18,15,20],[12,21,15,23],[1,7,3,9],[1,10,3,13],[6,2,6,5],[7,2,7,5],[8,2,8,5],[1,1,3,6],[19,15,21,17],[14,41,15,41],[15,2,16,5],[16,10,18,11],[16,12,18,14],[16,28,18,28],[16,30,18,30],[16,31,18,31],[16,32,18,32],[16,33,18,33],[13,25,15,27],[13,28,15,28],[14,30,14,31],[14,32,14,33],[14,34,14,35],[14,36,14,37],[16,40,18,40],[16,41,18,41],[16,35,18,35],[16,36,18,36],[16,37,18,37],[16,38,18,38],[16,39,18,39],[19,30,21,30],[19,31,21,31],[19,32,21,32],[22,32,24,32],[22,33,24,33],[22,34,24,34],[16,34,18,34],[19,39,21,39],[14,38,14,39],[19,40,21,40],[19,41,21,41],[22,1,23,1],[22,4,23,4],[22,10,24,11],[22,18,24,20],[22,28,24,28],[22,30,24,30],[22,31,24,31],[19,33,21,33],[19,34,21,34],[19,35,21,35],[19,36,21,36],[19,37,21,37],[19,38,21,38],[22,38,24,38],[22,39,24,39],[22,40,24,40],[22,41,24,41],[22,35,24,35],[22,36,24,36],[22,37,24,37],[19,1,20,1],[19,28,21,28],[25,37,27,37],[25,38,27,38],[25,39,27,39],[25,40,27,40],[25,41,27,41],[28,1,29,1],[28,4,29,4],[29,12,29,23],[25,31,27,31],[25,32,27,32],[25,33,27,33],[25,34,27,34],[25,35,27,35],[25,36,27,36],[25,1,26,1],[25,4,26,4],[25,10,27,11],[25,21,27,23],[25,28,27,28],[25,30,27,30],[48,1,48,10],[49,1,49,10],[50,1,50,10],[52,1,52,2],[12,10,15,11],[41,1,42,10],[43,1,43,10],[44,1,44,10],[45,1,45,10],[46,1,46,10],[47,1,47,10],[31,1,32,1],[31,4,32,4],[34,1,35,1],[34,4,35,4],[36,7,37,10],[38,1,39,1],[38,2,39,2],[38,3,39,5],[38,7,39,10],[19,4,20,4],[19,10,21,11]]}
[]
[null,{"$f":"'Saisie des joueurs'!C1","v":"LIGUE MEDITERRANEENNE DE BILLARD"},null,null,null,null,null,{"$f":"'Saisie des joueurs'!D7","v":0},null,null,{"$f":"'Saisie des joueurs'!D9","v":"LIBRE"}]
[]
[]
[]
[]
[null,"Joueur 1",{"$f":"'Saisie des joueurs'!L26","v":""}]
[null,"Joueur 2",{"$f":"'Saisie des joueurs'!L27","v":""}]
[null,"Joueur 3",{"$f":"'Saisie des joueurs'!L28","v":""}]
[null,"Joueur 4",{"$f":"'Saisie des joueurs'!L29","v":""}]
[]
[]
[null,"SAISIE DES RESULTATS",null,null,null,null,null,null,null,null,null,null,{"$f":"C7","v":""},null,null,{"$f":"C8","v":""},null,null,{"$f":"C9","v":""},null,null,{"$f":"C10","v":""}]
[null,null,null,null,null,null,null,null,null,null,null,null,null,null,null,null,null,null,null,null,null,null,null,null,null,"TOTAUX",null,null,"CLASSEMENT"]
[null,null,null,null,null,null,null,null,null,null,null,null,null,null,null,null,null,null,null,null,null,null,null,null,null,null,null,null,null,null,"Classement",null,"Classement",null,"Classement",null,"Classement",null,"Classement",null,"GENERAL","RANG"]
[null,null,"BILLARD 3",null,null,null,null,null,null,null,null,null,null,null,null,null,null,null,null,null,null,null,null,null,null,null,null,null,null,null,"Point-Match","CLS-M","Moy-Gen","CLS-G","Moy-Part","CLS-P","M-Series","CLS-S","MGPS","CLS","CLS"]
[null,null,null,null,null,null,null,null,null,null,{"$f":"C7","v":""},null,"L",null,null,{"$f":"D32","v":0},null,{"$f":"E32","v":0},{"$f":"D26","v":0},null,{"$f":"E26","v":0},{"$f":"D20","v":0},null,{"$f":"E20","v":0},null,{"$f":"P17+S17+V17","v":0},null,{"$f":"R17+U17+X17","v":0},{"$f":"AP17","v":{"$error":"#DIV/0!"}},null,{"$f":"AA18","v":0.03},{"$f":"RANK(AE17,AE$17:AE$28,0)","v":1},{"$f":"AB19","v":{"$error":"#DIV/0!"}},{"$f":"RANK(AG17,AG$17:AG$28,0)","v":{"$error":"#DIV/0!"}},{"$f":"MAX(R19,U19,X19)","v":{"$error":"#DIV/0!"}},{"$f":"RANK(AI17,AI$17:AI$28)","v":{"$error":"#DIV/0!"}},{"$f":"Z19","v":0},{"$f":"RANK(AK17,AK$17:AK$28)","v":1},{"$f":"(AF17*1000)+(AH17*100)+(AJ17*10)+(AL17*1)","v":{"$error":"#DIV/0!"}},{"$f":"AM17","v":{"$error":"#DIV/0!"}},{"$f":"RANK(AN17,AN$17:AN$28,1)","v":{"$error":"#DIV/0!"}},{"$f":"RANK(AO17,AO$17:AO$28,1)","v":{"$error":"#DIV/0!"}}]
[null,null,null,null,null,null,null,null,null,null,null,null,null,null,null,null,{"$f":"IF(R17<1,0.01,IF(P17>M20,2,IF(P17=M20,1,0)))","v":0.01},null,null,{"$f":"IF(U17<1,0.01,IF(S17>M23,2,IF(S17=M23,1,0)))","v":0.01},null,null,{"$f":"IF(X17<1,0.01,IF(V17>M26,2,IF(V17=M26,1,0)))","v":0.01},null,null,null,{"$f":"Q18+T18+W18","v":0.03}]
[null,null,null,"Pts","Rep","Série",null,null,null,null,null,null,null,null,null,{"$f":"F32","v":0},null,{"$f":"P17/R17","v":{"$error":"#DIV/0!"}},{"$f":"F26","v":0},null,{"$f":"S17/U17","v":{"$error":"#DIV/0!"}},{"$f":"F20","v":0},null,{"$f":"V17/X17","v":{"$error":"#DIV/0!"}},null,{"$f":"MAX(P19,S19,V19)","v":0},null,{"$f":"Z17/AB17","v":{"$error":"#DIV/0!"}}]
[null,"Tour 1",{"$f":"C7","v":""},null,null,null,null,null,null,null,{"$f":"C8","v":""},null,{"$f":"D33","v":0},null,{"$f":"E32","v":0},"M",null,null,{"$f":"D23","v":0},null,{"$f":"E23","v":0},{"$f":"D30","v":0},null,{"$f":"E29","v":0},null,{"$f":"M20+S20+V20","v":0},null,{"$f":"O20+U20+X20","v":0},{"$f":"AP20","v":{"$error":"#DIV/0!"}},null,{"$f":"AA21","v":0.03},{"$f":"RANK(AE20,AE$17:AE$28,0)","v":1},{"$f":"AB22","v":{"$error":"#DIV/0!"}},{"$f":"RANK(AG20,AG$17:AG$28,0)","v":{"$error":"#DIV/0!"}},{"$f":"MAX(O22,U22,X22)","v":{"$error":"#DIV/0!"}},{"$f":"RANK(AI20,AI$17:AI$28)","v":{"$error":"#DIV/0!"}},{"$f":"Z22","v":0},{"$f":"RANK(AK20,AK$17:AK$28)","v":1},{"$f":"(AF20*1000)+(AH20*100)+(AJ20*10)+(AL20*1)","v":{"$error":"#DIV/0!"}},{"$f":"AM20","v":{"$error":"#DIV/0!"}},{"$f":"RANK(AN20,AN$17:AN$28,1)","v":{"$error":"#DIV/0!"}},{"$error":"#DIV/0!"}]
[null,null,{"$f":"C10","v":""},null,null,null,null,null,null,null,null,null,null,{"$f":"IF(R17>0,2-Q18,0.01)","v":0.01},null,null,null,null,null,{"$f":"IF(U20<1,0.01,IF(S20>P23,2,IF(S20=P23,1,0)))","v":0.01},null,null,{"$f":"IF(X20<1,0.01,IF(V20>P26,2,IF(V20=P26,1,0)))","v":0.01},null,null,null,{"$f":"N21+T21+W21","v":0.03}]
[null,null,null,null,null,null,null,null,null,null,null,null,{"$f":"F33","v":0},null,{"$f":"M20/O20","v":{"$error":"#DIV/0!"}},null,null,null,{"$f":"F23","v":0},null,{"$f":"S20/U20","v":{"$error":"#DIV/0!"}},{"$f":"F30","v":0},null,{"$f":"V20/X20","v":{"$error":"#DIV/0!"}},null,{"$f":"MAXA(M22,S22,V22)","v":0},null,{"$f":"Z20/AB20","v":{"$error":"#DIV/0!"}}]
[null,"Tour 2",{"$f":"C8","v":""},null,null,null,null,null,null,null,{"$f":"C9","v":""},null,{"$f":"D27","v":0},null,{"$f":"E26","v":0},{"$f":"D24","v":0},null,{"$f":"E23","v":0},"B",null,null,{"$f":"D35","v":0},null,{"$f":"E35","v":0},null,{"$f":"M23+P23+V23","v":0},null,{"$f":"O23+R23+X23","v":0},{"$f":"AP23","v":{"$error":"#DIV/0!"}},null,{"$f":"AA24","v":0.03},{"$f":"RANK(AE23,AE$17:AE$28,0)","v":1},{"$f":"AB25","v":{"$error":"#DIV/0!"}},{"$f":"RANK(AG23,AG$17:AG$28,0)","v":{"$error":"#DIV/0!"}},{"$f":"MAX(O25,R25,X25)","v":{"$error":"#DIV/0!"}},{"$f":"RANK(AI23,AI$17:AI$28)","v":{"$error":"#DIV/0!"}},{"$f":"Z25","v":0},{"$f":"RANK(AK23,AK$17:AK$28)","v":1},{"$f":"(AF23*1000)+(AH23*100)+(AJ23*10)+(AL23*1)","v":{"$error":"#DIV/0!"}},{"$f":"AM23","v":{"$error":"#DIV/0!"}},{"$f":"RANK(AN23,AN$17:AN$28,1)","v":{"$error":"#DIV/0!"}},{"$error":"#DIV/0!"}]
[null,null,{"$f":"C9","v":""},null,null,null,null,null,null,null,null,null,null,{"$f":"IF(U17>0,2-T18,0.01)","v":0.01},null,null,{"$f":"IF(U20>0,2-T21,0.01)","v":0.01},null,null,null,null,null,{"$f":"IF(X23<1,0.01,IF(V23>S26,2,IF(V23=S26,1,0)))","v":0.01},null,null,null,{"$f":"N24+Q24+W24","v":0.03}]
[null,null,null,null,null,null,null,null,null,null,null,null,{"$f":"F27","v":0},null,{"$f":"M23/O23","v":{"$error":"#DIV/0!"}},{"$f":"F24","v":0},null,{"$f":"P23/R23","v":{"$error":"#DIV/0!"}},null,null,null,{"$f":"F35","v":0},null,{"$f":"V23/X23","v":{"$error":"#DIV/0!"}},null,{"$f":"MAXA(M25,P25,V25)","v":0},null,{"$f":"Z23/AB23","v":{"$error":"#DIV/0!"}}]
[null,"Tour 3",{"$f":"C7","v":""},null,null,null,null,null,null,null,{"$f":"C10","v":""},null,{"$f":"D21","v":0},null,{"$f":"E20","v":0},{"$f":"D29","v":0},null,{"$f":"E29","v":0},{"$f":"D36","v":0},null,{"$f":"E35","v":0},null,null,null,null,{"$f":"M26+P26+S26","v":0},null,{"$f":"O26+R26+U26","v":0},{"$f":"AP26","v":{"$error":"#DIV/0!"}},null,{"$f":"AA27","v":0.03},{"$f":"RANK(AE26,AE$17:AE$28,0)","v":1},{"$f":"AB28","v":{"$error":"#DIV/0!"}},{"$f":"RANK(AG26,AG$17:AG$28,0)","v":{"$error":"#DIV/0!"}},{"$f":"MAX(O28,R28,U28)","v":{"$error":"#DIV/0!"}},{"$f":"RANK(AI26,AI$17:AI$28)","v":{"$error":"#DIV/0!"}},{"$f":"Z28","v":0},{"$f":"RANK(AK26,AK$17:AK$28)","v":1},{"$f":"(AF26*1000)+(AH26*100)+(AJ26*10)+(AL26*1)","v":{"$error":"#DIV/0!"}},{"$f":"AM26","v":{"$error":"#DIV/0!"}},{"$f":"RANK(AN26,AN$17:AN$28,1)","v":{"$error":"#DIV/0!"}},{"$error":"#DIV/0!"}]
[null,null,{"$f":"C9","v":""},null,null,null,null,null,null,null,null,null,null,{"$f":"IF(X17>0,2-W18,0.01)","v":0.01},null,null,{"$f":"IF(X20>0,2-W21,0.01)","v":0.01},null,null,{"$f":"IF(X23>0,2-W24,0.01)","v":0.01},null,null,null,null,null,null,{"$f":"N27+Q27+T27","v":0.03}]
[null,null,null,null,null,null,null,null,null,null,null,null,{"$f":"F21","v":0},null,{"$f":"M26/O26","v":{"$error":"#DIV/0!"}},{"$f":"F29","v":0},null,{"$f":"P26/R26","v":{"$error":"#DIV/0!"}},{"$f":"F36","v":0},null,{"$f":"S26/U26","v":{"$error":"#DIV/0!"}},null,null,null,null,{"$f":"MAXA(M28,P28,S28)","v":0},null,{"$f":"Z26/AB26","v":{"$error":"#DIV/0!"}}]
[null,"Tour 4",{"$f":"C10","v":""}]
[null,null,{"$f":"C8","v":""},null,null,null,null,null,null,null,null,null,"Pas de prolongation en cas de match nul."]
[]
[null,"Tour 5",{"$f":"C7","v":""},null,null,null,null,null,null,null,null,null,"PRECISION CONCERNANT LA LIBRE :\nRemise sur mouches obligatoire en cas de contact lorqu'un N1 ou un Master est dans la partie."]
[null,null,{"$f":"C8","v":""}]
[]
[null,"Tour 6",{"$f":"C9","v":""}]
[null,null,{"$f":"C10","v":""}]
[null,null,null,null,null,null,null,"DIRECTEUR DE JEU :"]
[]
[null,"DATE : ",{"$f":"'Saisie des joueurs'!D5","v":"00:00:00"},null,null,null,null,{"$f":"'Saisie des joueurs'!G11","v":0}]
[]
[]
[null,"OBSERVATIONS"]
[]
[]
[]
[]
[]
[]
[]
[]
[]
[]
[null,"™A.FERHAT ™ C.PEREZ"]

{"sheet":"BILLARD 4","index":8,"n_rows":53,"n_cols":42,"rows_kept":53,"cut":false,"hidden":false,"merged":[[31,12,33,23],[9,2,9,5],[12,1,13,5],[12,12,15,14],[12,15,15,17],[12,18,15,20],[12,21,15,23],[1,7,3,9],[1,10,3,13],[6,2,6,5],[7,2,7,5],[8,2,8,5],[1,1,3,6],[19,15,21,17],[14,41,15,41],[15,2,16,5],[16,10,18,11],[16,12,18,14],[16,28,18,28],[16,30,18,30],[16,31,18,31],[16,32,18,32],[16,33,18,33],[13,25,15,27],[13,28,15,28],[14,30,14,31],[14,32,14,33],[14,34,14,35],[14,36,14,37],[16,40,18,40],[16,41,18,41],[16,35,18,35],[16,36,18,36],[16,37,18,37],[16,38,18,38],[16,39,18,39],[19,30,21,30],[19,31,21,31],[19,32,21,32],[22,32,24,32],[22,33,24,33],[22,34,24,34],[16,34,18,34],[19,39,21,39],[14,38,14,39],[19,40,21,40],[19,41,21,41],[22,1,23,1],[22,4,23,4],[22,10,24,11],[22,18,24,20],[22,28,24,28],[22,30,24,30],[22,31,24,31],[19,33,21,33],[19,34,21,34],[19,35,21,35],[19,36,21,36],[19,37,21,37],[19,38,21,38],[22,38,24,38],[22,39,24,39],[22,40,24,40],[22,41,24,41],[22,35,24,35],[22,36,24,36],[22,37,24,37],[19,1,20,1],[19,28,21,28],[25,37,27,37],[25,38,27,38],[25,39,27,39],[25,40,27,40],[25,41,27,41],[28,1,29,1],[28,4,29,4],[29,12,29,23],[25,31,27,31],[25,32,27,32],[25,33,27,33],[25,34,27,34],[25,35,27,35],[25,36,27,36],[25,1,26,1],[25,4,26,4],[25,10,27,11],[25,21,27,23],[25,28,27,28],[25,30,27,30],[48,1,48,10],[49,1,49,10],[50,1,50,10],[52,1,52,2],[12,10,15,11],[41,1,42,10],[43,1,43,10],[44,1,44,10],[45,1,45,10],[46,1,46,10],[47,1,47,10],[31,1,32,1],[31,4,32,4],[34,1,35,1],[34,4,35,4],[36,7,37,10],[38,1,39,1],[38,2,39,2],[38,3,39,5],[38,7,39,10],[19,4,20,4],[19,10,21,11]]}
[]
[null,{"$f":"'Saisie des joueurs'!C1","v":"LIGUE MEDITERRANEENNE DE BILLARD"},null,null,null,null,null,{"$f":"'Saisie des joueurs'!D7","v":0},null,null,{"$f":"'Saisie des joueurs'!D9","v":"LIBRE"}]
[]
[]
[]
[]
[null,"Joueur 1",{"$f":"'Saisie des joueurs'!L30","v":""}]
[null,"Joueur 2",{"$f":"'Saisie des joueurs'!L31","v":""}]
[null,"Joueur 3",{"$f":"'Saisie des joueurs'!L32","v":""}]
[null,"Joueur 4",{"$f":"'Saisie des joueurs'!L33","v":""}]
[]
[]
[null,"SAISIE DES RESULTATS",null,null,null,null,null,null,null,null,null,null,{"$f":"C7","v":""},null,null,{"$f":"C8","v":""},null,null,{"$f":"C9","v":""},null,null,{"$f":"C10","v":""}]
[null,null,null,null,null,null,null,null,null,null,null,null,null,null,null,null,null,null,null,null,null,null,null,null,null,"TOTAUX",null,null,"CLASSEMENT"]
[null,null,null,null,null,null,null,null,null,null,null,null,null,null,null,null,null,null,null,null,null,null,null,null,null,null,null,null,null,null,"Classement",null,"Classement",null,"Classement",null,"Classement",null,"Classement",null,"GENERAL","RANG"]
[null,null,"BILLARD 4",null,null,null,null,null,null,null,null,null,null,null,null,null,null,null,null,null,null,null,null,null,null,null,null,null,null,null,"Point-Match","CLS-M","Moy-Gen","CLS-G","Moy-Part","CLS-P","M-Series","CLS-S","MGPS","CLS","CLS"]
[null,null,null,null,null,null,null,null,null,null,{"$f":"C7","v":""},null,"L",null,null,{"$f":"D32","v":0},null,{"$f":"E32","v":0},{"$f":"D26","v":0},null,{"$f":"E26","v":0},{"$f":"D20","v":0},null,{"$f":"E20","v":0},null,{"$f":"P17+S17+V17","v":0},null,{"$f":"R17+U17+X17","v":0},{"$f":"AP17","v":{"$error":"#DIV/0!"}},null,{"$f":"AA18","v":0.03},{"$f":"RANK(AE17,AE$17:AE$28,0)","v":1},{"$f":"AB19","v":{"$error":"#DIV/0!"}},{"$f":"RANK(AG17,AG$17:AG$28,0)","v":{"$error":"#DIV/0!"}},{"$f":"MAX(R19,U19,X19)","v":{"$error":"#DIV/0!"}},{"$f":"RANK(AI17,AI$17:AI$28)","v":{"$error":"#DIV/0!"}},{"$f":"Z19","v":0},{"$f":"RANK(AK17,AK$17:AK$28)","v":1},{"$f":"(AF17*1000)+(AH17*100)+(AJ17*10)+(AL17*1)","v":{"$error":"#DIV/0!"}},{"$f":"AM17","v":{"$error":"#DIV/0!"}},{"$f":"RANK(AN17,AN$17:AN$28,1)","v":{"$error":"#DIV/0!"}},{"$f":"RANK(AO17,AO$17:AO$28,1)","v":{"$error":"#DIV/0!"}}]
[null,null,null,null,null,null,null,null,null,null,null,null,null,null,null,null,{"$f":"IF(R17<1,0.01,IF(P17>M20,2,IF(P17=M20,1,0)))","v":0.01},null,null,{"$f":"IF(U17<1,0.01,IF(S17>M23,2,IF(S17=M23,1,0)))","v":0.01},null,null,{"$f":"IF(X17<1,0.01,IF(V17>M26,2,IF(V17=M26,1,0)))","v":0.01},null,null,null,{"$f":"Q18+T18+W18","v":0.03}]
[null,null,null,"Pts","Rep","Série",null,null,null,null,null,null,null,null,null,{"$f":"F32","v":0},null,{"$f":"P17/R17","v":{"$error":"#DIV/0!"}},{"$f":"F26","v":0},null,{"$f":"S17/U17","v":{"$error":"#DIV/0!"}},{"$f":"F20","v":0},null,{"$f":"V17/X17","v":{"$error":"#DIV/0!"}},null,{"$f":"MAX(P19,S19,V19)","v":0},null,{"$f":"Z17/AB17","v":{"$error":"#DIV/0!"}}]
[null,"Tour 1",{"$f":"C7","v":""},null,null,null,null,null,null,null,{"$f":"C8","v":""},null,{"$f":"D33","v":0},null,{"$f":"E32","v":0},"M",null,null,{"$f":"D23","v":0},null,{"$f":"E23","v":0},{"$f":"D30","v":0},null,{"$f":"E29","v":0},null,{"$f":"M20+S20+V20","v":0},null,{"$f":"O20+U20+X20","v":0},{"$f":"AP20","v":{"$error":"#DIV/0!"}},null,{"$f":"AA21","v":0.03},{"$f":"RANK(AE20,AE$17:AE$28,0)","v":1},{"$f":"AB22","v":{"$error":"#DIV/0!"}},{"$f":"RANK(AG20,AG$17:AG$28,0)","v":{"$error":"#DIV/0!"}},{"$f":"MAX(O22,U22,X22)","v":{"$error":"#DIV/0!"}},{"$f":"RANK(AI20,AI$17:AI$28)","v":{"$error":"#DIV/0!"}},{"$f":"Z22","v":0},{"$f":"RANK(AK20,AK$17:AK$28)","v":1},{"$f":"(AF20*1000)+(AH20*100)+(AJ20*10)+(AL20*1)","v":{"$error":"#DIV/0!"}},{"$f":"AM20","v":{"$error":"#DIV/0!"}},{"$f":"RANK(AN20,AN$17:AN$28,1)","v":{"$error":"#DIV/0!"}},{"$error":"#DIV/0!"}]
[null,null,{"$f":"C10","v":""},null,null,null,null,null,null,null,null,null,null,{"$f":"IF(R17>0,2-Q18,0.01)","v":0.01},null,null,null,null,null,{"$f":"IF(U20<1,0.01,IF(S20>P23,2,IF(S20=P23,1,0)))","v":0.01},null,null,{"$f":"IF(X20<1,0.01,IF(V20>P26,2,IF(V20=P26,1,0)))","v":0.01},null,null,null,{"$f":"N21+T21+W21","v":0.03}]
[null,null,null,null,null,null,null,null,null,null,null,null,{"$f":"F33","v":0},null,{"$f":"M20/O20","v":{"$error":"#DIV/0!"}},null,null,null,{"$f":"F23","v":0},null,{"$f":"S20/U20","v":{"$error":"#DIV/0!"}},{"$f":"F30","v":0},null,{"$f":"V20/X20","v":{"$error":"#DIV/0!"}},null,{"$f":"MAXA(M22,S22,V22)","v":0},null,{"$f":"Z20/AB20","v":{"$error":"#DIV/0!"}}]
[null,"Tour 2",{"$f":"C8","v":""},null,null,null,null,null,null,null,{"$f":"C9","v":""},null,{"$f":"D27","v":0},null,{"$f":"E26","v":0},{"$f":"D24","v":0},null,{"$f":"E23","v":0},"B",null,null,{"$f":"D35","v":0},null,{"$f":"E35","v":0},null,{"$f":"M23+P23+V23","v":0},null,{"$f":"O23+R23+X23","v":0},{"$f":"AP23","v":{"$error":"#DIV/0!"}},null,{"$f":"AA24","v":0.03},{"$f":"RANK(AE23,AE$17:AE$28,0)","v":1},{"$f":"AB25","v":{"$error":"#DIV/0!"}},{"$f":"RANK(AG23,AG$17:AG$28,0)","v":{"$error":"#DIV/0!"}},{"$f":"MAX(O25,R25,X25)","v":{"$error":"#DIV/0!"}},{"$f":"RANK(AI23,AI$17:AI$28)","v":{"$error":"#DIV/0!"}},{"$f":"Z25","v":0},{"$f":"RANK(AK23,AK$17:AK$28)","v":1},{"$f":"(AF23*1000)+(AH23*100)+(AJ23*10)+(AL23*1)","v":{"$error":"#DIV/0!"}},{"$f":"AM23","v":{"$error":"#DIV/0!"}},{"$f":"RANK(AN23,AN$17:AN$28,1)","v":{"$error":"#DIV/0!"}},{"$error":"#DIV/0!"}]
[null,null,{"$f":"C9","v":""},null,null,null,null,null,null,null,null,null,null,{"$f":"IF(U17>0,2-T18,0.01)","v":0.01},null,null,{"$f":"IF(U20>0,2-T21,0.01)","v":0.01},null,null,null,null,null,{"$f":"IF(X23<1,0.01,IF(V23>S26,2,IF(V23=S26,1,0)))","v":0.01},null,null,null,{"$f":"N24+Q24+W24","v":0.03}]
[null,null,null,null,null,null,null,null,null,null,null,null,{"$f":"F27","v":0},null,{"$f":"M23/O23","v":{"$error":"#DIV/0!"}},{"$f":"F24","v":0},null,{"$f":"P23/R23","v":{"$error":"#DIV/0!"}},null,null,null,{"$f":"F35","v":0},null,{"$f":"V23/X23","v":{"$error":"#DIV/0!"}},null,{"$f":"MAXA(M25,P25,V25)","v":0},null,{"$f":"Z23/AB23","v":{"$error":"#DIV/0!"}}]
[null,"Tour 3",{"$f":"C7","v":""},null,null,null,null,null,null,null,{"$f":"C10","v":""},null,{"$f":"D21","v":0},null,{"$f":"E20","v":0},{"$f":"D29","v":0},null,{"$f":"E29","v":0},{"$f":"D36","v":0},null,{"$f":"E35","v":0},null,null,null,null,{"$f":"M26+P26+S26","v":0},null,{"$f":"O26+R26+U26","v":0},{"$f":"AP26","v":{"$error":"#DIV/0!"}},null,{"$f":"AA27","v":0.03},{"$f":"RANK(AE26,AE$17:AE$28,0)","v":1},{"$f":"AB28","v":{"$error":"#DIV/0!"}},{"$f":"RANK(AG26,AG$17:AG$28,0)","v":{"$error":"#DIV/0!"}},{"$f":"MAX(O28,R28,U28)","v":{"$error":"#DIV/0!"}},{"$f":"RANK(AI26,AI$17:AI$28)","v":{"$error":"#DIV/0!"}},{"$f":"Z28","v":0},{"$f":"RANK(AK26,AK$17:AK$28)","v":1},{"$f":"(AF26*1000)+(AH26*100)+(AJ26*10)+(AL26*1)","v":{"$error":"#DIV/0!"}},{"$f":"AM26","v":{"$error":"#DIV/0!"}},{"$f":"RANK(AN26,AN$17:AN$28,1)","v":{"$error":"#DIV/0!"}},{"$error":"#DIV/0!"}]
[null,null,{"$f":"C9","v":""},null,null,null,null,null,null,null,null,null,null,{"$f":"IF(X17>0,2-W18,0.01)","v":0.01},null,null,{"$f":"IF(X20>0,2-W21,0.01)","v":0.01},null,null,{"$f":"IF(X23>0,2-W24,0.01)","v":0.01},null,null,null,null,null,null,{"$f":"N27+Q27+T27","v":0.03}]
[null,null,null,null,null,null,null,null,null,null,null,null,{"$f":"F21","v":0},null,{"$f":"M26/O26","v":{"$error":"#DIV/0!"}},{"$f":"F29","v":0},null,{"$f":"P26/R26","v":{"$error":"#DIV/0!"}},{"$f":"F36","v":0},null,{"$f":"S26/U26","v":{"$error":"#DIV/0!"}},null,null,null,null,{"$f":"MAXA(M28,P28,S28)","v":0},null,{"$f":"Z26/AB26","v":{"$error":"#DIV/0!"}}]
[null,"Tour 4",{"$f":"C10","v":""}]
[null,null,{"$f":"C8","v":""},null,null,null,null,null,null,null,null,null,"Pas de prolongation en cas de match nul."]
[]
[null,"Tour 5",{"$f":"C7","v":""},null,null,null,null,null,null,null,null,null,"PRECISION CONCERNANT LA LIBRE :\nRemise sur mouches obligatoire en cas de contact lorqu'un N1 ou un Master est dans la partie."]
[null,null,{"$f":"C8","v":""}]
[]
[null,"Tour 6",{"$f":"C9","v":""}]
[null,null,{"$f":"C10","v":""}]
[null,null,null,null,null,null,null,"DIRECTEUR DE JEU :"]
[]
[null,"DATE : ",{"$f":"'Saisie des joueurs'!D5","v":"00:00:00"},null,null,null,null,{"$f":"'Saisie des joueurs'!G11","v":0}]
[]
[]
[null,"OBSERVATIONS"]
[]
[]
[]
[]
[]
[]
[]
[]
[]
[]
[null,"™A.FERHAT ™ C.PEREZ"]

{"sheet":"BILLARD 5","index":9,"n_rows":53,"n_cols":42,"rows_kept":53,"cut":false,"hidden":false,"merged":[[31,12,33,23],[9,2,9,5],[12,1,13,5],[12,12,15,14],[12,15,15,17],[12,18,15,20],[12,21,15,23],[1,7,3,9],[1,10,3,13],[6,2,6,5],[7,2,7,5],[8,2,8,5],[1,1,3,6],[19,15,21,17],[14,41,15,41],[15,2,16,5],[16,10,18,11],[16,12,18,14],[16,28,18,28],[16,30,18,30],[16,31,18,31],[16,32,18,32],[16,33,18,33],[13,25,15,27],[13,28,15,28],[14,30,14,31],[14,32,14,33],[14,34,14,35],[14,36,14,37],[16,40,18,40],[16,41,18,41],[16,35,18,35],[16,36,18,36],[16,37,18,37],[16,38,18,38],[16,39,18,39],[19,30,21,30],[19,31,21,31],[19,32,21,32],[22,32,24,32],[22,33,24,33],[22,34,24,34],[16,34,18,34],[19,39,21,39],[14,38,14,39],[19,40,21,40],[19,41,21,41],[22,1,23,1],[22,4,23,4],[22,10,24,11],[22,18,24,20],[22,28,24,28],[22,30,24,30],[22,31,24,31],[19,33,21,33],[19,34,21,34],[19,35,21,35],[19,36,21,36],[19,37,21,37],[19,38,21,38],[22,38,24,38],[22,39,24,39],[22,40,24,40],[22,41,24,41],[22,35,24,35],[22,36,24,36],[22,37,24,37],[19,1,20,1],[19,28,21,28],[25,37,27,37],[25,38,27,38],[25,39,27,39],[25,40,27,40],[25,41,27,41],[28,1,29,1],[28,4,29,4],[29,12,29,23],[25,31,27,31],[25,32,27,32],[25,33,27,33],[25,34,27,34],[25,35,27,35],[25,36,27,36],[25,1,26,1],[25,4,26,4],[25,10,27,11],[25,21,27,23],[25,28,27,28],[25,30,27,30],[48,1,48,10],[49,1,49,10],[50,1,50,10],[52,1,52,2],[12,10,15,11],[41,1,42,10],[43,1,43,10],[44,1,44,10],[45,1,45,10],[46,1,46,10],[47,1,47,10],[31,1,32,1],[31,4,32,4],[34,1,35,1],[34,4,35,4],[36,7,37,10],[38,1,39,1],[38,2,39,2],[38,3,39,5],[38,7,39,10],[19,4,20,4],[19,10,21,11]]}
[]
[null,{"$f":"'Saisie des joueurs'!C1","v":"LIGUE MEDITERRANEENNE DE BILLARD"},null,null,null,null,null,{"$f":"'Saisie des joueurs'!D7","v":0},null,null,{"$f":"'Saisie des joueurs'!D9","v":"LIBRE"}]
[]
[]
[]
[]
[null,"Joueur 1",{"$f":"'Saisie des joueurs'!L34","v":""}]
[null,"Joueur 2",{"$f":"'Saisie des joueurs'!L35","v":""}]
[null,"Joueur 3",{"$f":"'Saisie des joueurs'!L36","v":""}]
[null,"Joueur 4",{"$f":"'Saisie des joueurs'!L37","v":""}]
[]
[]
[null,"SAISIE DES RESULTATS",null,null,null,null,null,null,null,null,null,null,{"$f":"C7","v":""},null,null,{"$f":"C8","v":""},null,null,{"$f":"C9","v":""},null,null,{"$f":"C10","v":""}]
[null,null,null,null,null,null,null,null,null,null,null,null,null,null,null,null,null,null,null,null,null,null,null,null,null,"TOTAUX",null,null,"CLASSEMENT"]
[null,null,null,null,null,null,null,null,null,null,null,null,null,null,null,null,null,null,null,null,null,null,null,null,null,null,null,null,null,null,"Classement",null,"Classement",null,"Classement",null,"Classement",null,"Classement",null,"GENERAL","RANG"]
[null,null,"BILLARD 5",null,null,null,null,null,null,null,null,null,null,null,null,null,null,null,null,null,null,null,null,null,null,null,null,null,null,null,"Point-Match","CLS-M","Moy-Gen","CLS-G","Moy-Part","CLS-P","M-Series","CLS-S","MGPS","CLS","CLS"]
[null,null,null,null,null,null,null,null,null,null,{"$f":"C7","v":""},null,"L",null,null,{"$f":"D32","v":0},null,{"$f":"E32","v":0},{"$f":"D26","v":0},null,{"$f":"E26","v":0},{"$f":"D20","v":0},null,{"$f":"E20","v":0},null,{"$f":"P17+S17+V17","v":0},null,{"$f":"R17+U17+X17","v":0},{"$f":"AP17","v":{"$error":"#DIV/0!"}},null,{"$f":"AA18","v":0.03},{"$f":"RANK(AE17,AE$17:AE$28,0)","v":1},{"$f":"AB19","v":{"$error":"#DIV/0!"}},{"$f":"RANK(AG17,AG$17:AG$28,0)","v":{"$error":"#DIV/0!"}},{"$f":"MAX(R19,U19,X19)","v":{"$error":"#DIV/0!"}},{"$f":"RANK(AI17,AI$17:AI$28)","v":{"$error":"#DIV/0!"}},{"$f":"Z19","v":0},{"$f":"RANK(AK17,AK$17:AK$28)","v":1},{"$f":"(AF17*1000)+(AH17*100)+(AJ17*10)+(AL17*1)","v":{"$error":"#DIV/0!"}},{"$f":"AM17","v":{"$error":"#DIV/0!"}},{"$f":"RANK(AN17,AN$17:AN$28,1)","v":{"$error":"#DIV/0!"}},{"$f":"RANK(AO17,AO$17:AO$28,1)","v":{"$error":"#DIV/0!"}}]
[null,null,null,null,null,null,null,null,null,null,null,null,null,null,null,null,{"$f":"IF(R17<1,0.01,IF(P17>M20,2,IF(P17=M20,1,0)))","v":0.01},null,null,{"$f":"IF(U17<1,0.01,IF(S17>M23,2,IF(S17=M23,1,0)))","v":0.01},null,null,{"$f":"IF(X17<1,0.01,IF(V17>M26,2,IF(V17=M26,1,0)))","v":0.01},null,null,null,{"$f":"Q18+T18+W18","v":0.03}]
[null,null,null,"Pts","Rep","Série",null,null,null,null,null,null,null,null,null,{"$f":"F32","v":0},null,{"$f":"P17/R17","v":{"$error":"#DIV/0!"}},{"$f":"F26","v":0},null,{"$f":"S17/U17","v":{"$error":"#DIV/0!"}},{"$f":"F20","v":0},null,{"$f":"V17/X17","v":{"$error":"#DIV/0!"}},null,{"$f":"MAX(P19,S19,V19)","v":0},null,{"$f":"Z17/AB17","v":{"$error":"#DIV/0!"}}]
[null,"Tour 1",{"$f":"C7","v":""},null,null,null,null,null,null,null,{"$f":"C8","v":""},null,{"$f":"D33","v":0},null,{"$f":"E32","v":0},"M",null,null,{"$f":"D23","v":0},null,{"$f":"E23","v":0},{"$f":"D30","v":0},null,{"$f":"E29","v":0},null,{"$f":"M20+S20+V20","v":0},null,{"$f":"O20+U20+X20","v":0},{"$f":"AP20","v":{"$error":"#DIV/0!"}},null,{"$f":"AA21","v":0.03},{"$f":"RANK(AE20,AE$17:AE$28,0)","v":1},{"$f":"AB22","v":{"$error":"#DIV/0!"}},{"$f":"RANK(AG20,AG$17:AG$28,0)","v":{"$error":"#DIV/0!"}},{"$f":"MAX(O22,U22,X22)","v":{"$error":"#DIV/0!"}},{"$f":"RANK(AI20,AI$17:AI$28)","v":{"$error":"#DIV/0!"}},{"$f":"Z22","v":0},{"$f":"RANK(AK20,AK$17:AK$28)","v":1},{"$f":"(AF20*1000)+(AH20*100)+(AJ20*10)+(AL20*1)","v":{"$error":"#DIV/0!"}},{"$f":"AM20","v":{"$error":"#DIV/0!"}},{"$f":"RANK(AN20,AN$17:AN$28,1)","v":{"$error":"#DIV/0!"}},{"$error":"#DIV/0!"}]
[null,null,{"$f":"C10","v":""},null,null,null,null,null,null,null,null,null,null,{"$f":"IF(R17>0,2-Q18,0.01)","v":0.01},null,null,null,null,null,{"$f":"IF(U20<1,0.01,IF(S20>P23,2,IF(S20=P23,1,0)))","v":0.01},null,null,{"$f":"IF(X20<1,0.01,IF(V20>P26,2,IF(V20=P26,1,0)))","v":0.01},null,null,null,{"$f":"N21+T21+W21","v":0.03}]
[null,null,null,null,null,null,null,null,null,null,null,null,{"$f":"F33","v":0},null,{"$f":"M20/O20","v":{"$error":"#DIV/0!"}},null,null,null,{"$f":"F23","v":0},null,{"$f":"S20/U20","v":{"$error":"#DIV/0!"}},{"$f":"F30","v":0},null,{"$f":"V20/X20","v":{"$error":"#DIV/0!"}},null,{"$f":"MAXA(M22,S22,V22)","v":0},null,{"$f":"Z20/AB20","v":{"$error":"#DIV/0!"}}]
[null,"Tour 2",{"$f":"C8","v":""},null,null,null,null,null,null,null,{"$f":"C9","v":""},null,{"$f":"D27","v":0},null,{"$f":"E26","v":0},{"$f":"D24","v":0},null,{"$f":"E23","v":0},"B",null,null,{"$f":"D35","v":0},null,{"$f":"E35","v":0},null,{"$f":"M23+P23+V23","v":0},null,{"$f":"O23+R23+X23","v":0},{"$f":"AP23","v":{"$error":"#DIV/0!"}},null,{"$f":"AA24","v":0.03},{"$f":"RANK(AE23,AE$17:AE$28,0)","v":1},{"$f":"AB25","v":{"$error":"#DIV/0!"}},{"$f":"RANK(AG23,AG$17:AG$28,0)","v":{"$error":"#DIV/0!"}},{"$f":"MAX(O25,R25,X25)","v":{"$error":"#DIV/0!"}},{"$f":"RANK(AI23,AI$17:AI$28)","v":{"$error":"#DIV/0!"}},{"$f":"Z25","v":0},{"$f":"RANK(AK23,AK$17:AK$28)","v":1},{"$f":"(AF23*1000)+(AH23*100)+(AJ23*10)+(AL23*1)","v":{"$error":"#DIV/0!"}},{"$f":"AM23","v":{"$error":"#DIV/0!"}},{"$f":"RANK(AN23,AN$17:AN$28,1)","v":{"$error":"#DIV/0!"}},{"$error":"#DIV/0!"}]
[null,null,{"$f":"C9","v":""},null,null,null,null,null,null,null,null,null,null,{"$f":"IF(U17>0,2-T18,0.01)","v":0.01},null,null,{"$f":"IF(U20>0,2-T21,0.01)","v":0.01},null,null,null,null,null,{"$f":"IF(X23<1,0.01,IF(V23>S26,2,IF(V23=S26,1,0)))","v":0.01},null,null,null,{"$f":"N24+Q24+W24","v":0.03}]
[null,null,null,null,null,null,null,null,null,null,null,null,{"$f":"F27","v":0},null,{"$f":"M23/O23","v":{"$error":"#DIV/0!"}},{"$f":"F24","v":0},null,{"$f":"P23/R23","v":{"$error":"#DIV/0!"}},null,null,null,{"$f":"F35","v":0},null,{"$f":"V23/X23","v":{"$error":"#DIV/0!"}},null,{"$f":"MAXA(M25,P25,V25)","v":0},null,{"$f":"Z23/AB23","v":{"$error":"#DIV/0!"}}]
[null,"Tour 3",{"$f":"C7","v":""},null,null,null,null,null,null,null,{"$f":"C10","v":""},null,{"$f":"D21","v":0},null,{"$f":"E20","v":0},{"$f":"D29","v":0},null,{"$f":"E29","v":0},{"$f":"D36","v":0},null,{"$f":"E35","v":0},null,null,null,null,{"$f":"M26+P26+S26","v":0},null,{"$f":"O26+R26+U26","v":0},{"$f":"AP26","v":{"$error":"#DIV/0!"}},null,{"$f":"AA27","v":0.03},{"$f":"RANK(AE26,AE$17:AE$28,0)","v":1},{"$f":"AB28","v":{"$error":"#DIV/0!"}},{"$f":"RANK(AG26,AG$17:AG$28,0)","v":{"$error":"#DIV/0!"}},{"$f":"MAX(O28,R28,U28)","v":{"$error":"#DIV/0!"}},{"$f":"RANK(AI26,AI$17:AI$28)","v":{"$error":"#DIV/0!"}},{"$f":"Z28","v":0},{"$f":"RANK(AK26,AK$17:AK$28)","v":1},{"$f":"(AF26*1000)+(AH26*100)+(AJ26*10)+(AL26*1)","v":{"$error":"#DIV/0!"}},{"$f":"AM26","v":{"$error":"#DIV/0!"}},{"$f":"RANK(AN26,AN$17:AN$28,1)","v":{"$error":"#DIV/0!"}},{"$error":"#DIV/0!"}]
[null,null,{"$f":"C9","v":""},null,null,null,null,null,null,null,null,null,null,{"$f":"IF(X17>0,2-W18,0.01)","v":0.01},null,null,{"$f":"IF(X20>0,2-W21,0.01)","v":0.01},null,null,{"$f":"IF(X23>0,2-W24,0.01)","v":0.01},null,null,null,null,null,null,{"$f":"N27+Q27+T27","v":0.03}]
[null,null,null,null,null,null,null,null,null,null,null,null,{"$f":"F21","v":0},null,{"$f":"M26/O26","v":{"$error":"#DIV/0!"}},{"$f":"F29","v":0},null,{"$f":"P26/R26","v":{"$error":"#DIV/0!"}},{"$f":"F36","v":0},null,{"$f":"S26/U26","v":{"$error":"#DIV/0!"}},null,null,null,null,{"$f":"MAXA(M28,P28,S28)","v":0},null,{"$f":"Z26/AB26","v":{"$error":"#DIV/0!"}}]
[null,"Tour 4",{"$f":"C10","v":""}]
[null,null,{"$f":"C8","v":""},null,null,null,null,null,null,null,null,null,"Pas de prolongation en cas de match nul."]
[]
[null,"Tour 5",{"$f":"C7","v":""},null,null,null,null,null,null,null,null,null,"PRECISION CONCERNANT LA LIBRE :\nRemise sur mouches obligatoire en cas de contact lorqu'un N1 ou un Master est dans la partie."]
[null,null,{"$f":"C8","v":""}]
[]
[null,"Tour 6",{"$f":"C9","v":""}]
[null,null,{"$f":"C10","v":""}]
[null,null,null,null,null,null,null,"DIRECTEUR DE JEU :"]
[]
[null,"DATE : ",{"$f":"'Saisie des joueurs'!D5","v":"00:00:00"},null,null,null,null,{"$f":"'Saisie des joueurs'!G11","v":0}]
[]
[]
[null,"OBSERVATIONS"]
[]
[]
[]
[]
[]
[]
[]
[]
[]
[]
[null,"™A.FERHAT ™ C.PEREZ"]

{"sheet":"BILLARD 6","index":10,"n_rows":53,"n_cols":42,"rows_kept":53,"cut":false,"hidden":false,"merged":[[31,12,33,23],[9,2,9,5],[12,1,13,5],[12,12,15,14],[12,15,15,17],[12,18,15,20],[12,21,15,23],[1,7,3,9],[1,10,3,13],[6,2,6,5],[7,2,7,5],[8,2,8,5],[1,1,3,6],[19,15,21,17],[14,41,15,41],[15,2,16,5],[16,10,18,11],[16,12,18,14],[16,28,18,28],[16,30,18,30],[16,31,18,31],[16,32,18,32],[16,33,18,33],[13,25,15,27],[13,28,15,28],[14,30,14,31],[14,32,14,33],[14,34,14,35],[14,36,14,37],[16,40,18,40],[16,41,18,41],[16,35,18,35],[16,36,18,36],[16,37,18,37],[16,38,18,38],[16,39,18,39],[19,30,21,30],[19,31,21,31],[19,32,21,32],[22,32,24,32],[22,33,24,33],[22,34,24,34],[16,34,18,34],[19,39,21,39],[14,38,14,39],[19,40,21,40],[19,41,21,41],[22,1,23,1],[22,4,23,4],[22,10,24,11],[22,18,24,20],[22,28,24,28],[22,30,24,30],[22,31,24,31],[19,33,21,33],[19,34,21,34],[19,35,21,35],[19,36,21,36],[19,37,21,37],[19,38,21,38],[22,38,24,38],[22,39,24,39],[22,40,24,40],[22,41,24,41],[22,35,24,35],[22,36,24,36],[22,37,24,37],[19,1,20,1],[19,28,21,28],[25,37,27,37],[25,38,27,38],[25,39,27,39],[25,40,27,40],[25,41,27,41],[28,1,29,1],[28,4,29,4],[29,12,29,23],[25,31,27,31],[25,32,27,32],[25,33,27,33],[25,34,27,34],[25,35,27,35],[25,36,27,36],[25,1,26,1],[25,4,26,4],[25,10,27,11],[25,21,27,23],[25,28,27,28],[25,30,27,30],[48,1,48,10],[49,1,49,10],[50,1,50,10],[52,1,52,2],[12,10,15,11],[41,1,42,10],[43,1,43,10],[44,1,44,10],[45,1,45,10],[46,1,46,10],[47,1,47,10],[31,1,32,1],[31,4,32,4],[34,1,35,1],[34,4,35,4],[36,7,37,10],[38,1,39,1],[38,2,39,2],[38,3,39,5],[38,7,39,10],[19,4,20,4],[19,10,21,11]]}
[]
[null,{"$f":"'Saisie des joueurs'!C1","v":"LIGUE MEDITERRANEENNE DE BILLARD"},null,null,null,null,null,"T1",null,null,{"$f":"'Saisie des joueurs'!D9","v":"LIBRE"}]
[]
[]
[]
[]
[null,"Joueur 1",{"$f":"'Saisie des joueurs'!L38","v":""}]
[null,"Joueur 2",{"$f":"'Saisie des joueurs'!L39","v":""}]
[null,"Joueur 3",{"$f":"'Saisie des joueurs'!L40","v":""}]
[null,"Joueur 4",{"$f":"'Saisie des joueurs'!L41","v":""}]
[]
[]
[null,"SAISIE DES RESULTATS",null,null,null,null,null,null,null,null,null,null,{"$f":"C7","v":""},null,null,{"$f":"C8","v":""},null,null,{"$f":"C9","v":""},null,null,{"$f":"C10","v":""}]
[null,null,null,null,null,null,null,null,null,null,null,null,null,null,null,null,null,null,null,null,null,null,null,null,null,"TOTAUX",null,null,"CLASSEMENT"]
[null,null,null,null,null,null,null,null,null,null,null,null,null,null,null,null,null,null,null,null,null,null,null,null,null,null,null,null,null,null,"Classement",null,"Classement",null,"Classement",null,"Classement",null,"Classement",null,"GENERAL","RANG"]
[null,null,"BILLARD 6",null,null,null,null,null,null,null,null,null,null,null,null,null,null,null,null,null,null,null,null,null,null,null,null,null,null,null,"Point-Match","CLS-M","Moy-Gen","CLS-G","Moy-Part","CLS-P","M-Series","CLS-S","MGPS","CLS","CLS"]
[null,null,null,null,null,null,null,null,null,null,{"$f":"C7","v":""},null,"L",null,null,{"$f":"D32","v":0},null,{"$f":"E32","v":0},{"$f":"D26","v":0},null,{"$f":"E26","v":0},{"$f":"D20","v":0},null,{"$f":"E20","v":0},null,{"$f":"P17+S17+V17","v":0},null,{"$f":"R17+U17+X17","v":0},{"$f":"AP17","v":{"$error":"#DIV/0!"}},null,{"$f":"AA18","v":0.03},{"$f":"RANK(AE17,AE$17:AE$28,0)","v":1},{"$f":"AB19","v":{"$error":"#DIV/0!"}},{"$f":"RANK(AG17,AG$17:AG$28,0)","v":{"$error":"#DIV/0!"}},{"$f":"MAX(R19,U19,X19)","v":{"$error":"#DIV/0!"}},{"$f":"RANK(AI17,AI$17:AI$28)","v":{"$error":"#DIV/0!"}},{"$f":"Z19","v":0},{"$f":"RANK(AK17,AK$17:AK$28)","v":1},{"$f":"(AF17*1000)+(AH17*100)+(AJ17*10)+(AL17*1)","v":{"$error":"#DIV/0!"}},{"$f":"AM17","v":{"$error":"#DIV/0!"}},{"$f":"RANK(AN17,AN$17:AN$28,1)","v":{"$error":"#DIV/0!"}},{"$f":"RANK(AO17,AO$17:AO$28,1)","v":{"$error":"#DIV/0!"}}]
[null,null,null,null,null,null,null,null,null,null,null,null,null,null,null,null,{"$f":"IF(R17<1,0.01,IF(P17>M20,2,IF(P17=M20,1,0)))","v":0.01},null,null,{"$f":"IF(U17<1,0.01,IF(S17>M23,2,IF(S17=M23,1,0)))","v":0.01},null,null,{"$f":"IF(X17<1,0.01,IF(V17>M26,2,IF(V17=M26,1,0)))","v":0.01},null,null,null,{"$f":"Q18+T18+W18","v":0.03}]
[null,null,null,"Pts","Rep","Série",null,null,null,null,null,null,null,null,null,{"$f":"F32","v":0},null,{"$f":"P17/R17","v":{"$error":"#DIV/0!"}},{"$f":"F26","v":0},null,{"$f":"S17/U17","v":{"$error":"#DIV/0!"}},{"$f":"F20","v":0},null,{"$f":"V17/X17","v":{"$error":"#DIV/0!"}},null,{"$f":"MAX(P19,S19,V19)","v":0},null,{"$f":"Z17/AB17","v":{"$error":"#DIV/0!"}}]
[null,"Tour 1",{"$f":"C7","v":""},null,null,null,null,null,null,null,{"$f":"C8","v":""},null,{"$f":"D33","v":0},null,{"$f":"E32","v":0},"M",null,null,{"$f":"D23","v":0},null,{"$f":"E23","v":0},{"$f":"D30","v":0},null,{"$f":"E29","v":0},null,{"$f":"M20+S20+V20","v":0},null,{"$f":"O20+U20+X20","v":0},{"$f":"AP20","v":{"$error":"#DIV/0!"}},null,{"$f":"AA21","v":0.03},{"$f":"RANK(AE20,AE$17:AE$28,0)","v":1},{"$f":"AB22","v":{"$error":"#DIV/0!"}},{"$f":"RANK(AG20,AG$17:AG$28,0)","v":{"$error":"#DIV/0!"}},{"$f":"MAX(O22,U22,X22)","v":{"$error":"#DIV/0!"}},{"$f":"RANK(AI20,AI$17:AI$28)","v":{"$error":"#DIV/0!"}},{"$f":"Z22","v":0},{"$f":"RANK(AK20,AK$17:AK$28)","v":1},{"$f":"(AF20*1000)+(AH20*100)+(AJ20*10)+(AL20*1)","v":{"$error":"#DIV/0!"}},{"$f":"AM20","v":{"$error":"#DIV/0!"}},{"$f":"RANK(AN20,AN$17:AN$28,1)","v":{"$error":"#DIV/0!"}},{"$error":"#DIV/0!"}]
[null,null,{"$f":"C10","v":""},null,null,null,null,null,null,null,null,null,null,{"$f":"IF(R17>0,2-Q18,0.01)","v":0.01},null,null,null,null,null,{"$f":"IF(U20<1,0.01,IF(S20>P23,2,IF(S20=P23,1,0)))","v":0.01},null,null,{"$f":"IF(X20<1,0.01,IF(V20>P26,2,IF(V20=P26,1,0)))","v":0.01},null,null,null,{"$f":"N21+T21+W21","v":0.03}]
[null,null,null,null,null,null,null,null,null,null,null,null,{"$f":"F33","v":0},null,{"$f":"M20/O20","v":{"$error":"#DIV/0!"}},null,null,null,{"$f":"F23","v":0},null,{"$f":"S20/U20","v":{"$error":"#DIV/0!"}},{"$f":"F30","v":0},null,{"$f":"V20/X20","v":{"$error":"#DIV/0!"}},null,{"$f":"MAXA(M22,S22,V22)","v":0},null,{"$f":"Z20/AB20","v":{"$error":"#DIV/0!"}}]
[null,"Tour 2",{"$f":"C8","v":""},null,null,null,null,null,null,null,{"$f":"C9","v":""},null,{"$f":"D27","v":0},null,{"$f":"E26","v":0},{"$f":"D24","v":0},null,{"$f":"E23","v":0},"B",null,null,{"$f":"D35","v":0},null,{"$f":"E35","v":0},null,{"$f":"M23+P23+V23","v":0},null,{"$f":"O23+R23+X23","v":0},{"$f":"AP23","v":{"$error":"#DIV/0!"}},null,{"$f":"AA24","v":0.03},{"$f":"RANK(AE23,AE$17:AE$28,0)","v":1},{"$f":"AB25","v":{"$error":"#DIV/0!"}},{"$f":"RANK(AG23,AG$17:AG$28,0)","v":{"$error":"#DIV/0!"}},{"$f":"MAX(O25,R25,X25)","v":{"$error":"#DIV/0!"}},{"$f":"RANK(AI23,AI$17:AI$28)","v":{"$error":"#DIV/0!"}},{"$f":"Z25","v":0},{"$f":"RANK(AK23,AK$17:AK$28)","v":1},{"$f":"(AF23*1000)+(AH23*100)+(AJ23*10)+(AL23*1)","v":{"$error":"#DIV/0!"}},{"$f":"AM23","v":{"$error":"#DIV/0!"}},{"$f":"RANK(AN23,AN$17:AN$28,1)","v":{"$error":"#DIV/0!"}},{"$error":"#DIV/0!"}]
[null,null,{"$f":"C9","v":""},null,null,null,null,null,null,null,null,null,null,{"$f":"IF(U17>0,2-T18,0.01)","v":0.01},null,null,{"$f":"IF(U20>0,2-T21,0.01)","v":0.01},null,null,null,null,null,{"$f":"IF(X23<1,0.01,IF(V23>S26,2,IF(V23=S26,1,0)))","v":0.01},null,null,null,{"$f":"N24+Q24+W24","v":0.03}]
[null,null,null,null,null,null,null,null,null,null,null,null,{"$f":"F27","v":0},null,{"$f":"M23/O23","v":{"$error":"#DIV/0!"}},{"$f":"F24","v":0},null,{"$f":"P23/R23","v":{"$error":"#DIV/0!"}},null,null,null,{"$f":"F35","v":0},null,{"$f":"V23/X23","v":{"$error":"#DIV/0!"}},null,{"$f":"MAXA(M25,P25,V25)","v":0},null,{"$f":"Z23/AB23","v":{"$error":"#DIV/0!"}}]
[null,"Tour 3",{"$f":"C7","v":""},null,null,null,null,null,null,null,{"$f":"C10","v":""},null,{"$f":"D21","v":0},null,{"$f":"E20","v":0},{"$f":"D29","v":0},null,{"$f":"E29","v":0},{"$f":"D36","v":0},null,{"$f":"E35","v":0},null,null,null,null,{"$f":"M26+P26+S26","v":0},null,{"$f":"O26+R26+U26","v":0},{"$f":"AP26","v":{"$error":"#DIV/0!"}},null,{"$f":"AA27","v":0.03},{"$f":"RANK(AE26,AE$17:AE$28,0)","v":1},{"$f":"AB28","v":{"$error":"#DIV/0!"}},{"$f":"RANK(AG26,AG$17:AG$28,0)","v":{"$error":"#DIV/0!"}},{"$f":"MAX(O28,R28,U28)","v":{"$error":"#DIV/0!"}},{"$f":"RANK(AI26,AI$17:AI$28)","v":{"$error":"#DIV/0!"}},{"$f":"Z28","v":0},{"$f":"RANK(AK26,AK$17:AK$28)","v":1},{"$f":"(AF26*1000)+(AH26*100)+(AJ26*10)+(AL26*1)","v":{"$error":"#DIV/0!"}},{"$f":"AM26","v":{"$error":"#DIV/0!"}},{"$f":"RANK(AN26,AN$17:AN$28,1)","v":{"$error":"#DIV/0!"}},{"$error":"#DIV/0!"}]
[null,null,{"$f":"C9","v":""},null,null,null,null,null,null,null,null,null,null,{"$f":"IF(X17>0,2-W18,0.01)","v":0.01},null,null,{"$f":"IF(X20>0,2-W21,0.01)","v":0.01},null,null,{"$f":"IF(X23>0,2-W24,0.01)","v":0.01},null,null,null,null,null,null,{"$f":"N27+Q27+T27","v":0.03}]
[null,null,null,null,null,null,null,null,null,null,null,null,{"$f":"F21","v":0},null,{"$f":"M26/O26","v":{"$error":"#DIV/0!"}},{"$f":"F29","v":0},null,{"$f":"P26/R26","v":{"$error":"#DIV/0!"}},{"$f":"F36","v":0},null,{"$f":"S26/U26","v":{"$error":"#DIV/0!"}},null,null,null,null,{"$f":"MAXA(M28,P28,S28)","v":0},null,{"$f":"Z26/AB26","v":{"$error":"#DIV/0!"}}]
[null,"Tour 4",{"$f":"C10","v":""}]
[null,null,{"$f":"C8","v":""},null,null,null,null,null,null,null,null,null,"Pas de prolongation en cas de match nul."]
[]
[null,"Tour 5",{"$f":"C7","v":""},null,null,null,null,null,null,null,null,null,"PRECISION CONCERNANT LA LIBRE :\nRemise sur mouches obligatoire en cas de contact lorqu'un N1 ou un Master est dans la partie."]
[null,null,{"$f":"C8","v":""}]
[]
[null,"Tour 6",{"$f":"C9","v":""}]
[null,null,{"$f":"C10","v":""}]
[null,null,null,null,null,null,null,"DIRECTEUR DE JEU :"]
[]
[null,"DATE : ",{"$f":"'Saisie des joueurs'!D5","v":"00:00:00"},null,null,null,null,{"$f":"'Saisie des joueurs'!G11","v":0}]
[]
[]
[null,"OBSERVATIONS"]
[]
[]
[]
[]
[]
[]
[]
[]
[]
[]
[null,"™A.FERHAT ™ C.PEREZ"]

{"sheet":"Distances","index":11,"n_rows":17,"n_cols":6,"rows_kept":17,"cut":false,"hidden":false,"merged":[[16,1,16,2],[0,1,0,5],[1,1,1,5],[2,1,2,5],[3,1,3,5],[4,1,12,1],[4,4,4,5],[5,4,5,5],[14,1,14,5]]}
[null,"ANNEXE 1 au RS Carambole 2022-2023"]
[null,"LIGUE MEDITERANNEE BILLARD"]
[null,"Catégories et Distances pour les tournois de Ligue"]
[]
[null,"LIBRE","MASTER","GC","Joue N1"]
[null,null,"N 1","GC","200 Pts / 30 r"]
[]
[null,null,null,null,"2,80 m","3,10 m"]
[null,null,"N 3","GC","150 Pts / 30 r","120 Pts / 30 r"]
[null,null,"R 1","PC","120 Pts / 30 r","100 Pts / 30 r"]
[null,null,"R 2","PC","80 Pts / 30 r","70 Pts / 30 r"]
[null,null,"R 3","PC","60 Pts / 30 r","50 Pts / 30 r"]
[null,null,"R 4","PC","40 Pts / 30 r"]
[]
[]
[]
[null,"™A.FERHAT ™ C.PEREZ"]

{"sheet":"Heures convocations","index":12,"n_rows":15,"n_cols":7,"rows_kept":15,"cut":false,"hidden":false,"merged":[[0,0,0,6],[3,0,3,4],[5,3,5,5],[7,0,7,6],[9,0,12,0]]}
["LIGUE MEDITERRANEENNE DE BILLARD"]
[]
[]
["TOURNOI HOMOLOGUE",null,null,null,null,{"$f":"'Saisie des joueurs'!D7","v":0},{"$f":"'Saisie des joueurs'!D9","v":"LIBRE"}]
[]
[" "," "," ",{"$f":"'Saisie des joueurs'!D11:D11","v":0},null,null,{"$f":"'Saisie des joueurs'!D5","v":"00:00:00"}]
[]
["HORAIRES DES CONVOCATIONS JOUEURS"]
[]
["8 H 30",{"$f":"'Saisie des joueurs'!L18","v":""},{"$f":"'Saisie des joueurs'!L22","v":""},{"$f":"'Saisie des joueurs'!L26","v":""},{"$f":"'Saisie des joueurs'!L30","v":""},{"$f":"'Saisie des joueurs'!L34","v":""},{"$f":"'Saisie des joueurs'!L38","v":""}]
[null,{"$f":"'Saisie des joueurs'!L19","v":""},{"$f":"'Saisie des joueurs'!L23","v":""},{"$f":"'Saisie des joueurs'!L27","v":""},{"$f":"'Saisie des joueurs'!L31","v":""},{"$f":"'Saisie des joueurs'!L35","v":""},{"$f":"'Saisie des joueurs'!L39","v":""}]
[null,{"$f":"'Saisie des joueurs'!L20","v":""},{"$f":"'Saisie des joueurs'!L24","v":""},{"$f":"'Saisie des joueurs'!L28","v":""},{"$f":"'Saisie des joueurs'!L32","v":""},{"$f":"'Saisie des joueurs'!L36","v":""},{"$f":"'Saisie des joueurs'!L40","v":""}]
[null,{"$f":"'Saisie des joueurs'!L21","v":""},{"$f":"'Saisie des joueurs'!L25","v":""},{"$f":"'Saisie des joueurs'!L29","v":""},{"$f":"'Saisie des joueurs'!L33","v":""},{"$f":"'Saisie des joueurs'!L37","v":""},{"$f":"'Saisie des joueurs'!L41","v":""}]
[]
[null,"™A.FERHAT ™ C.PEREZ"]