{"text_format":"1","workbook":"xlsx","n_sheets":8,"sheets":["BOISSON","CLUB","DONNEES","FICHE-JOUEUR","Saisie des joueurs","GRAPHIQUE 24J","Distances","Heures convocations"],"not_rendered":{"charts":0,"images":3,"macros":1,"external_links":0,"defined_names":6,"comments":1,"pivot_tables":0},"unopened":[],"bounds":{"document_bytes":16777216,"sheet_cells":100000,"rows_first":2000,"rows_last":500,"rows_between":2000,"halvings":0,"cell_chars":16384,"cell_head_chars":4096},"cells_cut":0,"cells_raw":0,"read":"whole","date_system":"1900"}

{"sheet":"BOISSON","index":0,"n_rows":26,"n_cols":7,"rows_kept":26,"cut":false,"hidden":false,"merged":[[0,1,0,6]]}
[null,"BILLARD CLUB"]
["N°","Nom - Prénom","EAU","BOISSONS","REPAS","TOTAL","CLUB"]
[{"$f":"ROW(A1)","v":1},{"$f":"'Saisie des joueurs'!B18","v":0}]
[{"$f":"ROW(A2)","v":2},{"$f":"'Saisie des joueurs'!B19","v":0}]
[3,{"$f":"'Saisie des joueurs'!B20","v":0}]
[4,{"$f":"'Saisie des joueurs'!B21","v":0}]
[5,{"$f":"'Saisie des joueurs'!B22","v":0}]
[6,{"$f":"'Saisie des joueurs'!B23","v":0}]
[7,{"$f":"'Saisie des joueurs'!B24","v":0}]
[8,{"$f":"'Saisie des joueurs'!B25","v":0}]
[9,{"$f":"'Saisie des joueurs'!B26","v":0}]
[10,{"$f":"'Saisie des joueurs'!B27","v":0}]
[11,{"$f":"'Saisie des joueurs'!B28","v":0}]
[12,{"$f":"'Saisie des joueurs'!B29","v":0}]
[13,{"$f":"'Saisie des joueurs'!B30","v":0}]
[14,{"$f":"'Saisie des joueurs'!B31","v":0}]
[15,{"$f":"'Saisie des joueurs'!B32","v":0}]
[16,{"$f":"'Saisie des joueurs'!B33","v":0}]
[17,{"$f":"'Saisie des joueurs'!B34","v":0}]
[18,{"$f":"'Saisie des joueurs'!B35","v":0}]
[19,{"$f":"'Saisie des joueurs'!B36","v":0}]
[20,{"$f":"'Saisie des joueurs'!B37","v":0}]
[21,{"$f":"'Saisie des joueurs'!B38","v":0}]
[22,{"$f":"'Saisie des joueurs'!B39","v":0}]
[{"$f":"ROW(A23)","v":23},{"$f":"'Saisie des joueurs'!B40","v":0}]
[24,{"$f":"'Saisie des joueurs'!B41","v":0}]

{"sheet":"CLUB","index":1,"n_rows":27,"n_cols":5,"rows_kept":27,"cut":false,"hidden":true,"merged":[[0,0,0,4]]}
["CLUB AFFILIE LMB\n"]
["CLUB","ADRESSE 1","ADRESSE 2","CODE POSTAL","VILLE"]
["BILLARD CLUB DE ST RAPHAEL","90 RUE THOMAS EDISON","LA PALUD",83600,"FREJUS"]
["ACADEMIE DE BILLARD DE BOLLENE","GROUPE SCOLAIRE PIERRE MARIE CURIE",null,84500,"BOLLENE"]
["ACADEMIE DE BILLARD DE MENTON","Académie municipale de billard","Allée du Louvre Salon du Louvre",6500,"MENTON"]
["BILLARD CLUB  AIX EN PROVENCE","RUE PIERRE DE COUBERTIN",null,13100,"AIX EN PROVENCE"]
["BILLARD CLUB AMATEUR ROGNAC","60 BOULEVARD JEAN JAURES",null,13340,"ROGNAC"]
["BILLARD CLUB AVIGNONNAIS","12 RUE BONAPARTE","MAISON DU COMBATTANT",84000,"AVIGNON"]
["BILLARD CLUB BERROIS","RUE MARCEL PAGNOL",null,13130,"BERRE L ETANG"]
["BILLARD CLUB CARPENTRASSIEN","264 BOULEVARD ALBIN DURAND",null,84200,"CARPENTRAS"]
["BILLARD CLUB CAVAILLONNAIS","CERCLE DE L INDEPENDANCE","97 COURS VICTOR HUGO",84300,"CAVAILLON"]
["BILLARD CLUB CLUB ARLESIEN","1 RUE HONORE CLAIR",null,13200,"ARLES"]
["BILLARD CLUB DE LA BAIE CAVALAIRE","SALLE OTTAVI","AVENUE DES ALLIES",83240,"CAVALAIRE SUR MER"]
["ACADEMIE DE BILLARD DE BARBOSSI","COUNTRY CLIB DE BARBOSSI","23 CHEMIN DE MAURE-VIEL",6210,"MANDELIEU"]
["BILLARD CLUB DE NICE","SALLE MALATESTA","64 AVENUE CYRILLE BESSET",6100,"NICE"]
["BILLARD CLUB LA FARE LES OLIVIERS","36 BIS AVENUE PASTEUR",null,13580,"LA FARE LES OLIVIERS"]
["BILLARD CLUB LA GARDE","LE MAS QUARTIER SAINTE MARGUERITE","293 AVENUE PIERRE LOTI",83130,"LA GARDE"]
["BILLARD CLUB ORANGE","ACADEMIE DE BILLARD","67 COURS POURTOULES",84100,"ORANGE"]
["BILLARD CLUB ORANGE","MAISON DES ASSOCIATIONS","ROUTE DE CADEROUSSE",84100,"ORANGE"]
["BILLARD CLUB PHOCEEN","12 rue du docteur ACQUAVIVA",null,13004,"MARSEILLE"]
["BILLARD CLUB ROQUEBRUNOIS","44 avenue Gabriel Péri",null,83520,"ROQUEBRUNE SUR ARGENS"]
["BILLARD CLUB SALON","CERCLE DES ARTS","RUE DES FILEUSES DE SOIE",13300,"SALON DE PROVENCE"]
["BILLARD CLUB SAUSSET LES PINS","PARC MUNICIPAL DES LOISIRS","31 AVENUE DE LA COTE BLEUE",13960,"SAUSSET LES PINS"]
["BILLARD CLUB SISTERONNAIS","73 AVENUE DE LA DURANCE","SALLE OMNISPORT DANIEL MAFFREN",4200,"SISTERON"]
["BILLARD CLUB VINON SUR VERDON","480 RUE DES ENTREPRENEURS","ZA DU PAS DE MENC",83560,"VINON SUR VERDON"]
["CLUB BILLARD ISTRES","HALLE POLYVALENTE PLACE RAOUX","ALLEE DES ECHOPPES",13800,"ISTRES"]
["SPORT AMAT.DE BILLARD MARSEILLAIS","26 RUE PAVILLON",null,13001,"MARSEILLE"]

{"sheet":"DONNEES","index":2,"n_rows":386,"n_cols":6,"rows_kept":386,"cut":false,"hidden":false,"merged":[[0,0,0,5]]}
["Classification  L.M.B   3 BANDES\n 2023 - 2024"]
[]
["NC","NOM","LICENCE","CAT","MG","CLUB"]
[null,"ABAD YANNICK","106287Z","N2",0.46899999999999997,"19002--SPORT AMAT.DE BILLARD MARSEILLAIS"]
[null,"ABEAUZIT JACQUES","106902Q","N3",0.373,"19014--BILLARD CLUB AVIGNONNAIS"]
[null,"ABSENT",0,"XX",0,"XXXXXXXX"]
[null,"AKNIN GABRIEL","021810W","N2",0.47899999999999998,"19027--ACADEMIE DE BILLARD DE BOLLENE"]
[null,"ALLIGIER GERARD","157036R","R1",0.223,"19019--BILLARD CLUB DE LA BAIE"]
[null,"ALVAREZ PHILIPPE","159130S","R1",0.25600000000000001,"19056--BILLARD CLUB DE NICE"]
[null,"AMOUROUX LUC","155531F","R1",0.24199999999999999,"19023--BILLARD CLUB GARDEEN"]
[null,"ANDRY JEAN FRANCOIS","021818E","R1",0.28599999999999998,"19090--BILLARD AMATEUR ROGNAC"]
[null,"ANGIOLINI PIERRE","127654U","N2",0.46400000000000002,"19057--ACADEMIE VENCOISE DE BILLARD"]
[null,"ANGUE PATRICK","021819F","N1",0.69199999999999995,"19056--BILLARD CLUB DE NICE"]
[null,"ANNESTAY JACQUES","021820G","R1",0.27400000000000002,"19025--BILLARD CLUB SISTERONNAIS"]
[null,"ANTONIN ALAIN","021821H","N3",0.33200000000000002,"19021--BILLARD CLUB CAVAILLONNAIS"]
[null,"APREA ARMANDO","021823J","R1",0.3,"19106--BILLARD CLUB VINONNAIS"]
[null,"ARDITI GERALD","021825L","N3",0.38400000000000001,"19056--BILLARD CLUB DE NICE"]
[null,"ARMENGAUD NOEL","021826M","R1",0.24299999999999999,"19009--CLUB BILLARD ISTREEN"]
["NC","ARNOUX LAURENT","180272Y","R2",0.13,"19058 -- ACADEMIE DE BILLARD DE BARBOSSI MANDELIEU"]
[null,"AUBERT ROUECHE ERIC","022383X","N3",0.34399999999999997,"19106--BILLARD CLUB VINONNAIS"]
[null,"AUBERT ROUECHE LYDIA","148204R","R2",0.21099999999999999,"19106--BILLARD CLUB VINONNAIS"]
[null,"AZERAD HUGO","012464K","N1",0.61499999999999999,"19058--ACADEMIE DE BILLARD DE BARBOSSI MANDELIEU"]
[null,"AZOULAY ALAIN","021839Z","N2",0.54500000000000004,"19017--BILLARD CLUB PHOCEEN"]
[null,"BAILLON JEAN","115304U","R2",0.16900000000000001,"19058--ACADEMIE DE BILLARD DE BARBOSSI MANDELIEU"]
[null,"BALESTRI MAURICE","153554G","R2",0.19900000000000001,"19058--ACADEMIE DE BILLARD DE BARBOSSI MANDELIEU"]
[null,"BALLIGAND SERGE","023184S","N3",0.34,"19059--BILLARD CLUB ROQUEBRUNOIS"]
[null,"BANO SERGE","149693K","R2",0.186,"19001--S. S. A. B. D AIX EN PROVENCE"]
[null,"BARBANNEAU FREDERIC","109917P","N1",0.67200000000000004,"19012--SALON BILLARD CLUB"]
[null,"BASELGA PASCAL","135538A","R1",0.22900000000000001,"19093--AMERICAN CLUB LOUIS XI"]
[null,"BASSOUL JEAN MARIE","103568K","R2",0.20300000000000001,"19006--BILLARD CLUB CARPENTRASSIEN"]
[null,"BAYARD JEAN CLAUDE","021860U","R2",0.184,"19021--BILLARD CLUB CAVAILLONNAIS"]
[null,"BECK MICHEL","011797T","N2",0.39400000000000002,"19061--ACAD.BILLARD ST RAPHAEL"]
[null,"BEDOC JACQUES","021863X","R1",0.30299999999999999,"19007--BILLARD CLUB BERROIS"]
[null,"BENAVIDES GERARD","138275H","R2",0.20699999999999999,"19012--SALON BILLARD CLUB"]
[null,"BENIER PATRICK","159238K","R2",0.16600000000000001,"19023--BILLARD CLUB GARDEEN"]
[null,"BERNAT JEAN PIERRE","125945B","R2",0.19800000000000001,"19023--BILLARD CLUB GARDEEN"]
[null,"BETTES CECILE","016451T","R1",0.27400000000000002,"19012--SALON BILLARD CLUB"]
["NC","BETTONI GILLES","180334Q","R2",0.13,"19058--ACADEMIE DE BILLARD DE BARBOSSI MANDELIEU"]
[null,"BIARD ANDRE","159202W","R2",0.13500000000000001,"19009--CLUB BILLARD ISTREEN"]
[null,"BILDIK MEHMET","141828Y","N3",0.36699999999999999,"19006--BILLARD CLUB CARPENTRASSIEN"]
["NC","BLANC ERIC","179744Z","R2",0.13,"19009--CLUB BILLARD ISTREEN"]
[null,"BOFFA BERNARD","016248Y","R2",0.192,"19023--BILLARD CLUB GARDEEN"]
["NC","BOGGIO POLA PIERRE","181202J","R2",0.13,"19007--BILLARD CLUB BERROIS"]
[null,"BOMBA OLIVIER","125947D","R2",0.18,"19061--ACAD.BILLARD ST RAPHAEL"]
[null,"BONALD YVES","132947J","N3",0.33400000000000002,"19001--S. S. A. B. D AIX EN PROVENCE"]
[null,"BONNEMAISON DENIS","150422C","R2",0.20100000000000001,"19009--CLUB BILLARD ISTREEN"]
[null,"BONSIGNORI PATRICK","021898G","N3",0.39500000000000002,"19002--SPORT AMAT.DE BILLARD MARSEILLAIS"]
[null,"BONTOUX MAX","021900I","N3",0.34599999999999997,"19090--BILLARD AMATEUR ROGNAC"]
[null,"BORNMANN ROBERT","118781N","N2",0.55400000000000005,"19017--BILLARD CLUB PHOCEEN"]
[null,"BOULANDET ALAIN","012645J","R1",0.20699999999999999,"19055--ACADEMIE DE BILLARD DE MENTON"]
[null,"BOULANT CLAUDE","155529D","R1",0.20899999999999999,"19019--BILLARD CLUB DE LA BAIE"]
[null,"BOUTILLE NICOLAS","122662U","N3",0.33700000000000002,"19027--ACADEMIE DE BILLARD DE BOLLENE"]
[null,"BOVET MICHEL","149613Y","R2",0.13,"19059--BILLARD CLUB ROQUEBRUNOIS"]
[null,"BRAYER DENIS","016411F","N3",0.39800000000000002,"19008--BRITISH BILLARD CLUB AVIGNON"]
[null,"BREDAT RENE","021918A","N3",0.316,"19025--BILLARD CLUB SISTERONNAIS"]
[null,"BREPSON MARTIAL","152345S","N3",0.33300000000000002,"19058--ACADEMIE DE BILLARD DE BARBOSSI MANDELIEU"]
[null,"BREUGGHE JEAN","114355H","R2",0.161,"19006--BILLARD CLUB CARPENTRASSIEN"]
[null,"BRIAND ALAIN","113104E","R1",0.24299999999999999,"19002--SPORT AMAT.DE BILLARD MARSEILLAIS"]
[null,"BRIOIT DOMINIQUE","021920C","N3",0.32700000000000001,"19055--ACADEMIE DE BILLARD DE MENTON"]
[null,"BRIQUET ERIC","106514S","R2",0.16700000000000001,"19012--SALON BILLARD CLUB"]
[null,"BUI THAI NINH","109188O","N3",0.32300000000000001,"19055--ACADEMIE DE BILLARD DE MENTON"]
[null,"BULGHERONI NICOLAS","122928A","N3",0.41199999999999998,"19055--ACADEMIE DE BILLARD DE MENTON"]
[null,"BURELLI GEORGES","155679R","R2",0.13600000000000001,"19050--BILLARD CLUB SAUSSETOIS"]
[null,"BUSSONE REGIS","139222S","R2",0.13900000000000001,"19090--BILLARD AMATEUR ROGNAC"]
[null,"CACHO DIDIER","112311R","R1",0.28699999999999998,"19098--BILLARD CLUB LA FARE"]
[null,"CACHO MANUEL","110077T","R1",0.23699999999999999,"19098--BILLARD CLUB LA FARE"]
[null,"CAILLAUD DANIEL","144785R","R1",0.26200000000000001,"19023--BILLARD CLUB GARDEEN"]
[null,"CAILLET PATRICK","010401B","N3",0.41299999999999998,"19023--BILLARD CLUB GARDEEN"]
[null,"CALDERON LUC","021938U","N3",0.35399999999999998,"19009--CLUB BILLARD ISTREEN"]
[null,"CAO HUU TUOI","021944A","R1",0.26700000000000002,"19098 -- BILLARD CLUB LA FARE"]
[null,"CARDINALI DENIS","021946C","N3",0.33500000000000002,"19056--BILLARD CLUB DE NICE"]
[null,"CARRILLON MICHEL","141066Q","R1",0.248,"19001--S. S. A. B. D AIX EN PROVENCE"]
[null,"CARRION JEAN PHILIPPE","130701Z","N3",0.35199999999999998,"19058--ACADEMIE DE BILLARD DE BARBOSSI MANDELIEU"]
[null,"CASTA JEAN","021953J","N3",0.30099999999999999,"19025--BILLARD CLUB SISTERONNAIS"]
[null,"CATONI LAURENT","021955L","N2",0.45100000000000001,"19006--BILLARD CLUB CARPENTRASSIEN"]
[null,"CHABASSIERE DOMINIQUE","173622V","N2",0.45400000000000001,"19098--BILLARD CLUB LA FARE"]
[null,"CHABERT JEAN PIERRE","021958O","R1",0.29399999999999998,"19021--BILLARD CLUB CAVAILLONNAIS"]
[null,"CHADELAT BERNARD","114501X","R1",0.30099999999999999,"19106--BILLARD CLUB VINONNAIS"]
[null,"CHAIX JOEL","021960Q","N3",0.28499999999999998,"19025--BILLARD CLUB SISTERONNAIS"]
[null,"CHANOINA YANICK","021965V","N2",0.48599999999999999,"19061--ACAD.BILLARD ST RAPHAEL"]
[null,"CHAPUIS GERARD","163134V","R2",0.129,"19093--AMERICAN CLUB LOUIS XI"]
[null,"CHARBAUT CLAUDE","122456W","R1",0.13600000000000001,"19059--BILLARD CLUB ROQUEBRUNOIS"]
[null,"CHARBIT JEAN MARC","021967X","N1",0.58199999999999996,"19056--BILLARD CLUB DE NICE"]
[null,"CHARBONNIER DAVID","107542G","N1",0.63700000000000001,"19019--BILLARD CLUB DE LA BAIE"]
[null,"CHARTIER YVES","021971B","R1",0.153,"19090--BILLARD AMATEUR ROGNAC"]
[null,"CHASTAN GEORGES","012782Q","N3",0.36099999999999999,"19021--BILLARD CLUB CAVAILLONNAIS"]
[null,"CHAUVIN JEAN PAUL","021972C","R1",0.307,"19050--BILLARD CLUB SAUSSETOIS"]
[null,"CHESNAIS CHRISTOPHE","012793B","N2",0.434,"19055--ACADEMIE DE BILLARD DE MENTON"]
[null,"CHEVALLIER MICHEL","145444A","R1",0.24299999999999999,"19061--ACAD.BILLARD ST RAPHAEL"]
[null,"CHUZEVILLE GILLES","108854S","N2",0.46600000000000003,"19025--BILLARD CLUB SISTERONNAIS"]
[null,"CLEMENT GERARD","129497R","N3",0.35899999999999999,"19050--BILLARD CLUB SAUSSETOIS"]
[null,"COATMEUR ALAN","149116H","R1",0.251,"19014--BILLARD CLUB AVIGNONNAIS"]
[null,"COHEN RICHARD","012827J","R1",0.252,"19058--ACADEMIE DE BILLARD DE BARBOSSI MANDELIEU"]
[null,"COLLEMINE BERNARD","113219P","R1",0.28599999999999998,"19050--BILLARD CLUB SAUSSETOIS"]
[null,"CONSOLIN DANIEL","127970Y","R2",0.154,"19007--BILLARD CLUB BERROIS"]
[null,"COPPIN JEAN MICHEL","021985P","R1",0.14000000000000001,"19027--ACADEMIE DE BILLARD DE BOLLENE"]
[null,"CORANOTTO SERGE","021986Q","N1",0.82099999999999995,"19056--BILLARD CLUB DE NICE"]
[null,"CORDONNIER ROGER","106512Q","R1",0.24099999999999999,"19027--ACADEMIE DE BILLARD DE BOLLENE"]
[null,"CORNIOU JEAN CLAUDE","012844A","R1",0.23200000000000001,"19025--BILLARD CLUB SISTERONNAIS"]
[null,"COSTAZ ALAIN","148136S","R2",0.14699999999999999,"19019--BILLARD CLUB DE LA BAIE"]
[null,"COSTE PHILIPPE","125938U","R1",0.30299999999999999,"19061--ACAD.BILLARD ST RAPHAEL"]
[null,"COUPET PHILIPPE","119932U","N1",0.67900000000000005,"19023--BILLARD CLUB GARDEEN"]
[null,"COURRET JEAN PAUL","101490M","R1",0.16500000000000001,"19007--BILLARD CLUB BERROIS"]
[null,"CREUZOT PATRICE","021996A","N3",0.442,"19017--BILLARD CLUB PHOCEEN"]
[null,"D HERET ERIC","119971H","R1",0.29399999999999998,"19006--BILLARD CLUB CARPENTRASSIEN"]
[null,"DAMON GERARD","022002G","N3",0.26100000000000001,"19056--BILLARD CLUB DE NICE"]
[null,"DAMON OLIVIER","022003H","N1",0.65100000000000002,"19012--SALON BILLARD CLUB"]
[null,"DAUPHIN MICHEL","014828I","N1",0.626,"19012--SALON BILLARD CLUB"]
[null,"DE HAAN PATRICK","140113Z","N1",0.72499999999999998,"19061--ACAD.BILLARD ST RAPHAEL"]
[null,"DE LOOSE FELIX","163348C","N3",0.36699999999999999,"19106 -- BILLARD CLUB VINONNAIS"]
[null,"DEBERNARDI ARNAUD","109536Y","N3",0.40500000000000003,"19007--BILLARD CLUB BERROIS"]
[null,"DEDON RICHARD","177233V","R2",0.17299999999999999,"19007--BILLARD CLUB BERROIS"]
[null,"DEFFE MICHEL","119889D","R1",0.26,"19068--BILLARD CLUB ARLESIEN"]
[null,"DEFRETIN JOEL","020635R","N3",0.36799999999999999,"19023--BILLARD CLUB GARDEEN"]
[null,"DEL MEDICO JEAN","016772C","N3",0.32400000000000001,"19061--ACAD.BILLARD ST RAPHAEL"]
[null,"DELAGE JEAN MARIE","022013R","N2",0.40600000000000003,"19056--BILLARD CLUB DE NICE"]
[null,"DEMANET CLAUDE","020524K","N2",0.434,"19057--ACADEMIE VENCOISE DE BILLARD"]
[null,"DESWAZIERE MICHEL","115051B","N2",0.47099999999999997,"19027--ACADEMIE DE BILLARD DE BOLLENE"]
[null,"DHAINAUT JEAN FRANCOIS","022033L","N2",0.498,"19056--BILLARD CLUB DE NICE"]
[null,"DI CINTIO BENJAMIN","159059Q","R1",0.22600000000000001,"19014--BILLARD CLUB AVIGNONNAIS"]
[null,"DI CINTIO PHILIPPE","144569J","N3",0.40100000000000002,"19014--BILLARD CLUB AVIGNONNAIS"]
[null,"DI CRESCENZO PIERRE","109528Q","N3",0.36699999999999999,"19017--BILLARD CLUB PHOCEEN"]
[null,"DONABEDIAN DANIEL","142363N","N3",0.33500000000000002,"19058--ACADEMIE DE BILLARD DE BARBOSSI MANDELIEU"]
[null,"DORNEL GERARD","013003D","N3",0.245,"19061--ACAD.BILLARD ST RAPHAEL"]
[null,"DOS SANTOS FRANCIS","022039R","N2",0.53500000000000003,"19050--BILLARD CLUB SAUSSETOIS"]
["NC","DREMEAUX JEAN PIERRE","140803N","N3",0.31,"19023--BILLARD CLUB GARDEEN"]
[null,"DUBREUIL FRANCK","013022W","N2",0.52300000000000002,"19061--ACAD.BILLARD ST RAPHAEL"]
[null,"DUCA ALFONSO","154651Z","R2",0.107,"19090--BILLARD AMATEUR ROGNAC"]
[null,"DUMET BRUNO","013037L","N3",0.33,"19023--BILLARD CLUB GARDEEN"]
[null,"DUPERRAY ALEX","147554K","R2",0.14899999999999999,"19016--BILLARD CLUB ORANGEOIS"]
[null,"DUPUIS MICHEL","105621J","R1",0.223,"19019--BILLARD CLUB DE LA BAIE"]
[null,"DUPUY MICHEL","011522E","R1",0.22,"19058--ACADEMIE DE BILLARD DE BARBOSSI MANDELIEU"]
[null,"DURAND FREDERIC","022049B","N3",0.30099999999999999,"19012--SALON BILLARD CLUB"]
[null,"DURAND HERVE","022050C","N2",0.57899999999999996,"19012--SALON BILLARD CLUB"]
[null,"DUSFOUR RENE","022052E","N3",0.33400000000000002,"19012--SALON BILLARD CLUB"]
[null,"DUSSAULE PIERRE","102285B","N3",0.308,"19027--ACADEMIE DE BILLARD DE BOLLENE"]
[null,"DUVAL THIERRY","175172E","R2",0.21199999999999999,"19061--ACAD.BILLARD ST RAPHAEL"]
[null,"EL MEGHARY MAROUANE","140809T","N2",0.51100000000000001,"19002--SPORT AMAT.DE BILLARD MARSEILLAIS"]
[null,"ELEOUET DANIEL","163467G","N3",0.26200000000000001,"19006--BILLARD CLUB CARPENTRASSIEN"]
[null,"ENJOLRAS PIERRE","105440K","R1",0.27100000000000002,"19050--BILLARD CLUB SAUSSETOIS"]
[null,"ESTABLIER PIERRE","147622J","R2",0.17899999999999999,"19023--BILLARD CLUB GARDEEN"]
[null,"ESTRUGO HENRI","117567V","R2",0.13,"19012--SALON BILLARD CLUB"]
[null,"FAGET FRANCIS","101511H","N3",0.35299999999999998,"19001--S. S. A. B. D AIX EN PROVENCE"]
[null,"FAIVRE D ARCIER PATRICK","022061N","N1",0.52200000000000002,"19056--BILLARD CLUB DE NICE"]
[null,"FARINA GENNARO","176105T","R2",0.19700000000000001,"19061--ACAD.BILLARD ST RAPHAEL"]
[null,"FAURE EMILE","022065R","R1",0.249,"19016--BILLARD CLUB ORANGEOIS"]
[null,"FERAUD GERARD","022067T","N3",0.32600000000000001,"19027--ACADEMIE DE BILLARD DE BOLLENE"]
[null,"FERHAT ACHOUR","129036Y","N3",0.33100000000000002,"19106--BILLARD CLUB VINONNAIS"]
[null,"FERNANDES VINCENT","022071X","N3",0.29799999999999999,"19061--ACAD.BILLARD ST RAPHAEL"]
[null,"FERNANDEZ MARC","013111H","N2",0.42699999999999999,"19007--BILLARD CLUB BERROIS"]
[null,"FERRAT RAYMOND","022076C","N1",0.626,"19012--SALON BILLARD CLUB"]
[null,"FERRO PHILIPPE","122658Q","R1",0.23300000000000001,"19009--CLUB BILLARD ISTREEN"]
[null,"FLEURIOT PATRICK","173138T","R2",0.157,"19014--BILLARD CLUB AVIGNONNAIS"]
[null,"FONTAINE DANY","101139Z","N3",0.33500000000000002,"19106 -- BILLARD CLUB VINONNAIS"]
[null,"FOSSATI BRUNO","022082I","N3",0.312,"19023--BILLARD CLUB GARDEEN"]
[null,"FOURNIER ANDRE","139588U","N3",0.34499999999999997,"19023--BILLARD CLUB GARDEEN"]
[null,"FRANCO ALBERT","022084K","N2",0.435,"19019--BILLARD CLUB DE LA BAIE"]
[null,"FRANCO HENRY","118688Y","N3",0.33300000000000002,"19055--ACADEMIE DE BILLARD DE MENTON"]
[null,"FROMEYER CORINNE","167290M","R2",0.11700000000000001,"19058--ACADEMIE DE BILLARD DE BARBOSSI MANDELIEU"]
[null,"FUTERAL MAX","022088O","N2",0.41899999999999998,"983--Licenciés indépendants 83"]
[null,"GALARDINI RICHARD","142316S","R1",0.24199999999999999,"19050--BILLARD CLUB SAUSSETOIS"]
[null,"GALLUCCI STEPHANE","022091R","N1",0.625,"19056--BILLARD CLUB DE NICE"]
[null,"GANTOIS GILLES","022092S","N2",0.45400000000000001,"19016--BILLARD CLUB ORANGEOIS"]
[null,"GARREVOET DENIS","142272A","R1",0.28000000000000003,"19027--ACADEMIE DE BILLARD DE BOLLENE"]
[null,"GATTINO MARCO","147262S","R2",0.20200000000000001,"19055--ACADEMIE DE BILLARD DE MENTON"]
[null,"GATTO ANTOINE","022097X","R2",0.17299999999999999,"19050--BILLARD CLUB SAUSSETOIS"]
[null,"GAUCHER JULIEN","112833T","N1",0.79300000000000004,"19004--JFP BILLARD DE VIDAUBAN"]
[null,"GAVALDA PIERRE","116278G","N2",0.48,"19006--BILLARD CLUB CARPENTRASSIEN"]
[null,"GAVANON ANDRE","125944A","N3",0.33200000000000002,"19023--BILLARD CLUB GARDEEN"]
[null,"GELAS BERNARD","163279C","R2",0.157,"19098--BILLARD CLUB LA FARE"]
[null,"GENTILI ROBERTO","022100A","N2",0.57299999999999995,"19056--BILLARD CLUB DE NICE"]
[null,"GEORGE ALAIN","022101B","N3",0.32100000000000001,"19057--ACADEMIE VENCOISE DE BILLARD"]
[null,"GERVAIS GUILLAUME","022104E","N2",0.48699999999999999,"19021--BILLARD CLUB CAVAILLONNAIS"]
[null,"GHU GERARD","101282M","R1",0.30299999999999999,"19016--BILLARD CLUB ORANGEOIS"]
[null,"GIACONIA HERBERT","104472E","R1",0.22800000000000001,"19058--ACADEMIE DE BILLARD DE BARBOSSI MANDELIEU"]
[null,"GIBARROUX CHRISTOPHE","118661X","R1",0.27,"19001--S. S. A. B. D AIX EN PROVENCE"]
[null,"GIFFARD PHILIPPE","149390F","N2",0.42099999999999999,"19023--BILLARD CLUB GARDEEN"]
[null,"GIOVANNETTI DAMIEN","022115P","R1",0.24399999999999999,"19050--BILLARD CLUB SAUSSETOIS"]
[null,"GIRARD JACQUES","129718E","R1",0.26400000000000001,"19058--ACADEMIE DE BILLARD DE BARBOSSI MANDELIEU"]
[null,"GODARD PASCAL","157852D","R1",0.30499999999999999,"19006--BILLARD CLUB CARPENTRASSIEN"]
[null,"GOMES VITOR","120100G","N2",0.503,"19001--S. S. A. B. D AIX EN PROVENCE"]
[null,"GOUDENECHE BERNARD","131925B","R1",0.253,"19098--BILLARD CLUB LA FARE"]
[null,"GOUIRAN GEORGES","022129D","R2",0.16600000000000001,"19050--BILLARD CLUB SAUSSETOIS"]
[null,"GOUKASSIAN JACQUES","113216M","N3",0.40300000000000002,"19050--BILLARD CLUB SAUSSETOIS"]
[null,"GOURSEAUD YVES","104054C","N2",0.34599999999999997,"19016--BILLARD CLUB ORANGEOIS"]
[null,"GREGOIRE J CLAUDE","149576H","R2",0.186,"19016--BILLARD CLUB ORANGEOIS"]
[null,"GRUAT ALAIN","022134I","N2",0.46500000000000002,"19002--SPORT AMAT.DE BILLARD MARSEILLAIS"]
[null,"GUERI ROBERT","135013V","R2",0.154,"19027--ACADEMIE DE BILLARD DE BOLLENE"]
[null,"GUERINEAU BRUNO","144796C","N3",0.33900000000000002,"19021--BILLARD CLUB CAVAILLONNAIS"]
[null,"GUEUG PIERRE","104475H","R1",0.23,"19056--BILLARD CLUB DE NICE"]
[null,"GUEZOU MATHIS","151649L","R2",0.128,"19012--SALON BILLARD CLUB"]
[null,"GUIBERT JEAN MARIE","022137L","R1",0.17499999999999999,"19009--CLUB BILLARD ISTREEN"]
[null,"GUSTIN ANDRE","109915N","R2",0.17799999999999999,"19009--CLUB BILLARD ISTREEN"]
[null,"GUTIERREZ FRANCOIS","022138M","R1",0.27300000000000002,"19017--BILLARD CLUB PHOCEEN"]
[null,"HAHN DANIEL","011966G","R1",0.23,"19017--BILLARD CLUB PHOCEEN"]
[null,"HAROUTUNIAN PIERRE","022141P","R1",0.17100000000000001,"19050--BILLARD CLUB SAUSSETOIS"]
[null,"HAZE PATRICK","137523J","R1",0.16800000000000001,"19021--BILLARD CLUB CAVAILLONNAIS"]
[null,"HERBER DOMINIQUE","159610P","R1",0.28399999999999997,"19027--ACADEMIE DE BILLARD DE BOLLENE"]
[null,"HERREMAN SERGE","119933V","R1",0.22500000000000001,"19023--BILLARD CLUB GARDEEN"]
[null,"HEURTAULT JACKY","137004K","N3",0.35899999999999999,"19012--SALON BILLARD CLUB"]
[null,"HMAYDA YOUSSEF","132460Q","N2",0.55200000000000005,"19056--BILLARD CLUB DE NICE"]
[null,"HUGUET PATRICK","172086A","N2",0.49299999999999999,"19017--BILLARD CLUB PHOCEEN"]
[null,"ICART MICHEL","022154C","N3",0.314,"19057--ACADEMIE VENCOISE DE BILLARD"]
[null,"JAMET PIERRE","179136N","R2",0.157,"19055--ACADEMIE DE BILLARD DE MENTON"]
[null,"JAVEY JEAN FRANCOIS","120276A","R2",0.191,"19019--BILLARD CLUB DE LA BAIE"]
[null,"JIMENEZ RICARDO","109065V","N3",0.33800000000000002,"19055--ACADEMIE DE BILLARD DE MENTON"]
[null,"JONNARD FREDERIC","120814S","N2",0.51,"19023--BILLARD CLUB GARDEEN"]
[null,"JUBILEU DANIEL","127033X","N3",0.38600000000000001,"19058--ACADEMIE DE BILLARD DE BARBOSSI MANDELIEU"]
[null,"JUMEL RENE","162905W","R1",0.222,"19027--ACADEMIE DE BILLARD DE BOLLENE"]
[null,"KOPACZEWSKI DANIEL","116642G","N3",0.36199999999999999,"19061--ACAD.BILLARD ST RAPHAEL"]
[null,"KOSKACH JEAN PAUL","022173V","N3",0.38400000000000001,"19017--BILLARD CLUB PHOCEEN"]
[null,"LACOSSE JEAN PAUL","109977X","R1",0.19,"19019--BILLARD CLUB DE LA BAIE"]
[null,"LACOSTE BRUNO","147195V","N2",0.45100000000000001,"19056--BILLARD CLUB DE NICE"]
["NC","LAFDJIAN GILBERT","177232T","R2",0.13,"19007--BILLARD CLUB BERROIS"]
[null,"LAGIERE CHRISTIAN","151312V","R2",0.124,"19019--BILLARD CLUB DE LA BAIE"]
[null,"LANDE GERARD","016084Q","N2",0.46600000000000003,"19014--BILLARD CLUB AVIGNONNAIS"]
["NC","LANDERECTHE PASCAL","181199F","R2",0.13,"19007--BILLARD CLUB BERROIS"]
["NC","LANDERECTHE RUDY","181200G","R2",0.13,"19007--BILLARD CLUB BERROIS"]
[null,"LANNURIEN THIERRY","168288X","N3",0.34799999999999998,"19023--BILLARD CLUB GARDEEN"]
[null,"LATIL YVES","022192O","R1",0.27100000000000002,"19025--BILLARD CLUB SISTERONNAIS"]
[null,"LAVASTROU ROGER","022195R","N3",0.26600000000000001,"19014--BILLARD CLUB AVIGNONNAIS"]
[null,"LE THAN HAI","132346G","N3",0.35399999999999998,"19056--BILLARD CLUB DE NICE"]
[null,"LEBAR PATRICK","110799N","N3",0.31,"19090--BILLARD AMATEUR ROGNAC"]
[null,"LEBRASSEUR GILBERT","022198U","N3",0.35699999999999998,"19058--ACADEMIE DE BILLARD DE BARBOSSI MANDELIEU"]
[null,"LECOQ ARNAUD","141504M","N3",0.318,"19012--SALON BILLARD CLUB"]
[null,"LECOQ SYLVIE","151648K","R2",7.8E-2,"19012--SALON BILLARD CLUB"]
[null,"LEDRU RAYMOND","022203Z","N2",0.39400000000000002,"19020--A.O.C. LA VALETTE SECTION BILLARD"]
[null,"LEDU GERARD","135537Z","R2",9.2999999999999999E-2,"19006--BILLARD CLUB CARPENTRASSIEN"]
[null,"LEDUCQ MORGAN","105373V","N2",0.50700000000000001,"19014--BILLARD CLUB AVIGNONNAIS"]
[null,"LEFAUX JEAN JACQUES","117411V","N3",0.34100000000000003,"19025--BILLARD CLUB SISTERONNAIS"]
[null,"LEMARTINET ROBERT","110379J","R1",0.252,"19019--BILLARD CLUB DE LA BAIE"]
[null,"LEMESLE FABRICE","022205B","R1",0.26600000000000001,"19017--BILLARD CLUB PHOCEEN"]
[null,"LEMIERE JEAN NOEL","104233Z","N2",0.47799999999999998,"19023--BILLARD CLUB GARDEEN"]
[null,"LEROY ANDRE","022206C","R1",0.29799999999999999,"19058--ACADEMIE DE BILLARD DE BARBOSSI MANDELIEU"]
[null,"LEVAVASSEUR ROBERT","131535B","N2",0.48899999999999999,"19025--BILLARD CLUB SISTERONNAIS"]
[null,"LEVEQUE DAVID","141067R","N3",0.377,"19007--BILLARD CLUB BERROIS"]
[null,"LIOU THAI HUNG","122673F","N1",0.63700000000000001,"19058--ACADEMIE DE BILLARD DE BARBOSSI MANDELIEU"]
[null,"LISI ROGER","146375V","R2",0.121,"19007--BILLARD CLUB BERROIS"]
[null,"LOCKS TIMOTHY","174810L","R2",0.157,"19025--BILLARD CLUB SISTERONNAIS"]
[null,"LOMBARDO PHILIPPE","022215L","N2",0.46100000000000002,"19055--ACADEMIE DE BILLARD DE MENTON"]
[null,"LOPEZ JOSE","107094A","N2",0.47199999999999998,"19106--BILLARD CLUB VINONNAIS"]
[null,"LUCENET PAUL","162076V","R1",0.17899999999999999,"19009--CLUB BILLARD ISTREEN"]
[null,"LUVISON JEAN","022221R","R2",0.10199999999999999,"19012--SALON BILLARD CLUB"]
[null,"MACIA RENE","114274E","N1",0.54700000000000004,"19057--ACADEMIE VENCOISE DE BILLARD"]
[null,"MACQUET PATRICK","022223T","N1",0.745,"19056--BILLARD CLUB DE NICE"]
[null,"MARCIANO GEORGES","108280Q","N3",0.27900000000000003,"19058--ACADEMIE DE BILLARD DE BARBOSSI MANDELIEU"]
[null,"MARTIN FERNAND","022238I","R1",0.20300000000000001,"19106--BILLARD CLUB VINONNAIS"]
[null,"MARTIN MICHEL","022239J","N3",0.26100000000000001,"19090--BILLARD AMATEUR ROGNAC"]
[null,"MARTIN THOMAS","137032M","R1",0.28799999999999998,"19027--ACADEMIE DE BILLARD DE BOLLENE"]
[null,"MASRASLIGILLER MARDIROS","130160E","R1",0.26700000000000002,"19056--BILLARD CLUB DE NICE"]
[null,"MASSERAN PHILIPPE","103581X","N1",0.627,"19058--ACADEMIE DE BILLARD DE BARBOSSI MANDELIEU"]
[null,"MASSON DENIS","015513R","R2",0.17,"19023--BILLARD CLUB GARDEEN"]
[null,"MATHIEU CLAUDE","129498S","R1",0.183,"19098--BILLARD CLUB LA FARE"]
[null,"MAUDUIT DIDIER","017615N","R1",0.215,"19009--CLUB BILLARD ISTREEN"]
[null,"MAURON BERNARD","149391G","N3",0.32100000000000001,"19023--BILLARD CLUB GARDEEN"]
[null,"MENGUY PHILIPPE","103621L","N3",0.35799999999999998,"19055--ACADEMIE DE BILLARD DE MENTON"]
[null,"METAIS ALBAN","152604Z","R1",0.30399999999999999,"19006--BILLARD CLUB CARPENTRASSIEN"]
[null,"MICHEL GROSJEAN CEDRIC","133204G","R1",0.27,"19057--ACADEMIE VENCOISE DE BILLARD"]
["NC","MILANAS NICOLAS","176968G","R2",0.13,"19007--BILLARD CLUB BERROIS"]
[null,"MILLOT ROBERT","172218T","R2",0.21099999999999999,"19025--BILLARD CLUB SISTERONNAIS"]
[null,"MISSION JEAN","102551H","N3",0.29499999999999998,"19058--ACADEMIE DE BILLARD DE BARBOSSI MANDELIEU"]
[null,"MOGLIA EMILE","022266K","N3",0.34399999999999997,"19014--BILLARD CLUB AVIGNONNAIS"]
[null,"MOLAND PHILIPPE","022268M","R1",0.29099999999999998,"19059--BILLARD CLUB ROQUEBRUNOIS"]
[null,"MOLINAS ROBERT","022270O","R1",0.30399999999999999,"19021--BILLARD CLUB CAVAILLONNAIS"]
[null,"MONNET JEAN CLAUDE","022271P","N2",0.48899999999999999,"19021--BILLARD CLUB CAVAILLONNAIS"]
[null,"MONTAY JEAN CLAUDE","014997V","N3",0.28799999999999998,"19027--ACADEMIE DE BILLARD DE BOLLENE"]
[null,"MORENO BASTIEN","101279J","R1",0.28699999999999998,"19007--BILLARD CLUB BERROIS"]
[null,"MORPOURGO SIMON","022278W","R2",0.14199999999999999,"19007--BILLARD CLUB BERROIS"]
[null,"MUNOS JEAN","109063T","N2",0.44800000000000001,"19050--BILLARD CLUB SAUSSETOIS"]
[null,"MUNOS VINCENT","109708O","N3",0.29499999999999998,"19007--BILLARD CLUB BERROIS"]
[null,"N GUYEN VAN DUC MAX","141788K","R1",0.24299999999999999,"19007--BILLARD CLUB BERROIS"]
[null,"NABHANE EMILE","166329S","R2",0.13600000000000001,"19006--BILLARD CLUB CARPENTRASSIEN"]
[null,"NASICA PATRICK","107263N","N3",0.38700000000000001,"19021--BILLARD CLUB CAVAILLONNAIS"]
[null,"NOEL SYLVAIN","104487T","R1",0.27,"19058--ACADEMIE DE BILLARD DE BARBOSSI MANDELIEU"]
[null,"OLLIVIER DANIEL","020258E","R1",0.254,"19009--CLUB BILLARD ISTREEN"]
[null,"OUDOUX GERARD","128468C","R2",0.16700000000000001,"19023--BILLARD CLUB GARDEEN"]
[null,"PACZESNY FABRICE","150400D","R1",0.251,"19098--BILLARD CLUB LA FARE"]
[null,"PAGANONI GEORGES","022302U","N3",0.32,"19023--BILLARD CLUB GARDEEN"]
[null,"PAQUET MICHEL","118659V","R2",0.126,"19014--BILLARD CLUB AVIGNONNAIS"]
[null,"PARINELLO RENE","022308A","N3",0.43,"19023--BILLARD CLUB GARDEEN"]
[null,"PARIZE MICHEL","105442M","Masters",0.90700000000000003,"19058--ACADEMIE DE BILLARD DE BARBOSSI MANDELIEU"]
[null,"PAVIOT DIDIER","153692G","R1",0.307,"19023--BILLARD CLUB GARDEEN"]
[null,"PELLAT FRANCIS","141673Z","R1",0.29699999999999999,"19025--BILLARD CLUB SISTERONNAIS"]
[null,"PELLAT JACQUES","112424A","N3",0.30199999999999999,"19017--BILLARD CLUB PHOCEEN"]
[null,"PENEDO MANUEL","103577T","N3",0.32800000000000001,"19106--BILLARD CLUB VINONNAIS"]
[null,"PEREIRA CHARLES","013896M","N1",0.68700000000000006,"19023--BILLARD CLUB GARDEEN"]
[null,"PEREZ CHRISTIAN","130773T","R1",0.20300000000000001,"19009--CLUB BILLARD ISTREEN"]
[null,"PERIES MICHEL","022319L","N2",0.48399999999999999,"19025--BILLARD CLUB SISTERONNAIS"]
[null,"PERIS MICHEL","022321N","R2",5.7000000000000002E-2,"19056--BILLARD CLUB DE NICE"]
[null,"PICHEREAU GERARD","022329V","N3",0.38900000000000001,"19050--BILLARD CLUB SAUSSETOIS"]
[null,"PICOLLET MANUEL","129330G","N2",0.45900000000000002,"19090--BILLARD AMATEUR ROGNAC"]
[null,"PIELIN PASCAL","022330W","N2",0.46500000000000002,"19012--SALON BILLARD CLUB"]
[null,"PIGNARD CHARLES","106899N","N3",0.41199999999999998,"19061--ACAD.BILLARD ST RAPHAEL"]
[null,"PIGNATEL FLORENT","112316W","N1",0.60499999999999998,"19021--BILLARD CLUB CAVAILLONNAIS"]
[null,"PILAVDJIAN JACQUES","165118B","R2",0.20699999999999999,"19017--BILLARD CLUB PHOCEEN"]
[null,"PINARD PATRICE","105404A","N1",0.70499999999999996,"19012--SALON BILLARD CLUB"]
[null,"PINNA ALAIN","022332Y","N2",0.51800000000000002,"19017--BILLARD CLUB PHOCEEN"]
[null,"PINNA VINCENT","148229T","R1",0.30599999999999999,"19017--BILLARD CLUB PHOCEEN"]
[null,"PIONE GUY","022335B","R1",0.29499999999999998,"19007--BILLARD CLUB BERROIS"]
[null,"POIRET JEAN MARC","022341H","R1",0.18,"19061--ACAD.BILLARD ST RAPHAEL"]
[null,"POIRIER DOMINIQUE","108010G","R1",0.23599999999999999,"19061--ACAD.BILLARD ST RAPHAEL"]
[null,"PORA JEAN PAUL","170697Q","R1",0.16300000000000001,"19009--CLUB BILLARD ISTREEN"]
["NC","PORTET PATRICK","181316H","R2",0.13,"19059--BILLARD CLUB ROQUEBRUNOIS"]
[null,"POUJOL JEAN PAUL","022347N","R1",0.23499999999999999,"19014--BILLARD CLUB AVIGNONNAIS"]
[null,"POULAIN FREDERIC","144719D","R2",0.189,"19016--BILLARD CLUB ORANGEOIS"]
[null,"POZNANSKI JEAN MICHEL","022349P","N3",0.42199999999999999,"19012--SALON BILLARD CLUB"]
[null,"POZNANSKI LOIC","105485D","N3",0.33,"19012--SALON BILLARD CLUB"]
[null,"PRACHAR JEAN PIERRE","017857V","R1",0.245,"19059--BILLARD CLUB ROQUEBRUNOIS"]
[null,"PUT MARCEL","022353T","R2",0.14799999999999999,"19006--BILLARD CLUB CARPENTRASSIEN"]
[null,"QUANTIN MICHEL","022354U","R1",0.28499999999999998,"19098--BILLARD CLUB LA FARE"]
[null,"QUEZEL ANDRE","136544S","R2",0.10299999999999999,"19014--BILLARD CLUB AVIGNONNAIS"]
[null,"RANC ALAIN","136205R","R1",0.29099999999999998,"19027--ACADEMIE DE BILLARD DE BOLLENE"]
[null,"RAVEL PIERRE","101519P","N3",0.32600000000000001,"19017--BILLARD CLUB PHOCEEN"]
[null,"RAVERDINO JULIEN","103561D","N2",0.46700000000000003,"19057--ACADEMIE VENCOISE DE BILLARD"]
[null,"REMUS STEPHANE","022360A","N2",0.51300000000000001,"19056--BILLARD CLUB DE NICE"]
[null,"REVALOR MICHEL","119696S","R1",0.22600000000000001,"19050--BILLARD CLUB SAUSSETOIS"]
[null,"RICART ANDRE","133646G","N3",0.32300000000000001,"19009--CLUB BILLARD ISTREEN"]
[null,"RICHARD GUY","022367H","N3",0.34499999999999997,"19023--BILLARD CLUB GARDEEN"]
[null,"RICHAUD PIERRE","107093Z","N3",0.29199999999999998,"19106--BILLARD CLUB VINONNAIS"]
[null,"RIFFET BERNARD","125943Z","R2",0.20699999999999999,"19014--BILLARD CLUB AVIGNONNAIS"]
[null,"RIGA JEAN LOUIS","022371L","N3",0.31,"19002--SPORT AMAT.DE BILLARD MARSEILLAIS"]
[null,"RIGNOLS PHILIPPE","022372M","N2",0.439,"19021--BILLARD CLUB CAVAILLONNAIS"]
[null,"RIGOLLET PIERRE","023064C","N2",0.45500000000000002,"19025--BILLARD CLUB SISTERONNAIS"]
[null,"ROBBE RAYMOND","134183X","N3",0.37,"19098--BILLARD CLUB LA FARE"]
[null,"ROBERT DIDIER","022450M","N2",0.48099999999999998,"19014--BILLARD CLUB AVIGNONNAIS"]
[null,"RONSAIN JEAN JACQUES","166175A","R1",0.21199999999999999,"19012--SALON BILLARD CLUB"]
[null,"ROTH ALAIN","166176B","R2",0.14899999999999999,"19012--SALON BILLARD CLUB"]
[null,"ROUANET CLAUDE","163166E","N3",0.34100000000000003,"19025--BILLARD CLUB SISTERONNAIS"]
[null,"ROUGON ROBERT","101518O","R1",0.30099999999999999,"19090--BILLARD AMATEUR ROGNAC"]
[null,"ROUX CLAUDE","022384Y","N2",0.503,"19050--BILLARD CLUB SAUSSETOIS"]
[null,"SALAMA ALAIN","136546U","N3",0.40500000000000003,"19021--BILLARD CLUB CAVAILLONNAIS"]
[null,"SALES RENE","114734W","N2",0.41799999999999998,"19068--BILLARD CLUB ARLESIEN"]
[null,"SANTIAGO JEAN JOSEPH","022391F","N2",0.54600000000000004,"19050--BILLARD CLUB SAUSSETOIS"]
[null,"SARRALDE LOUIS","014138U","N3",0.21299999999999999,"19021--BILLARD CLUB CAVAILLONNAIS"]
[null,"SAVOIA MICKAEL","122939L","R2",0.17,"19050--BILLARD CLUB SAUSSETOIS"]
[null,"SAVOIA PATRICK","113222S","N3",0.32,"19050--BILLARD CLUB SAUSSETOIS"]
[null,"SCHAEFER ERNEST ROBERT","149694L","R2",0.15,"19006--BILLARD CLUB CARPENTRASSIEN"]
[null,"SCHEKLER JEAN FLORIAN","022399N","R1",0.28299999999999997,"19061--ACAD.BILLARD ST RAPHAEL"]
[null,"SCHMIDT CLAUDE","022401P","N3",0.39500000000000002,"19023--BILLARD CLUB GARDEEN"]
[null,"SCHOLTEN GERT","139284C","N3",0.33100000000000002,"19020--A.O.C. LA VALETTE SECTION BILLARD"]
[null,"SICARD GEORGES","163238H","R2",0.17199999999999999,"19025--BILLARD CLUB SISTERONNAIS"]
[null,"SIMON GERARD","010203L","N3",0.41099999999999998,"19014--BILLARD CLUB AVIGNONNAIS"]
[null,"SINANIAN JEAN PAUL","022412A","N3",0.41599999999999998,"19017--BILLARD CLUB PHOCEEN"]
[null,"SOLTANI OMAR","103578U","N3",0.27500000000000002,"19106--BILLARD CLUB VINONNAIS"]
[null,"STEINMANN SEBASTIEN","020790Q","N3",0.33200000000000002,"19061--ACAD.BILLARD ST RAPHAEL"]
[null,"STEPHAN OLIVIER","125931N","R1",0.30599999999999999,"19025--BILLARD CLUB SISTERONNAIS"]
[null,"STERCKX PIERRE","144720E","R2",0.157,"19016--BILLARD CLUB ORANGEOIS"]
[null,"SUEUR PASCAL","165039Q","R1",0.252,"19058 -- ACADEMIE DE BILLARD DE BARBOSSI MANDELIEU"]
[null,"TARDIEUX LUC","022429R","R1",0.193,"19007--BILLARD CLUB BERROIS"]
[null,"TARDY JEAN CLAUDE","133907H","R2",0.16300000000000001,"19014--BILLARD CLUB AVIGNONNAIS"]
[null,"TARDY PIERRE YVES","143024Y","R1",0.30099999999999999,"19058--ACADEMIE DE BILLARD DE BARBOSSI MANDELIEU"]
[null,"TATTIS HENRI","118668E","R1",0.248,"19050--BILLARD CLUB SAUSSETOIS"]
[null,"TERZIAN BERNARD","148464Z","N3",0.35099999999999998,"19090--BILLARD AMATEUR ROGNAC"]
[null,"TOLEDANO ARMAND","111163N","N3",0.28000000000000003,"19017--BILLARD CLUB PHOCEEN"]
[null,"TONNELIER JEAN PIERRE","132786E","R1",0.22600000000000001,"19106--BILLARD CLUB VINONNAIS"]
[null,"TONOLI PASCAL","022438A","N3",0.32800000000000001,"19059--BILLARD CLUB ROQUEBRUNOIS"]
[null,"TORREGROSA GILBERT","022440C","R1",0.27200000000000002,"19058--ACADEMIE DE BILLARD DE BARBOSSI MANDELIEU"]
[null,"TOURE MADOU","014256I","N1",0.67300000000000004,"19002--SPORT AMAT.DE BILLARD MARSEILLAIS"]
[null,"TRAN DINH VUONG","131929F","N2",0.46200000000000002,"19002--SPORT AMAT.DE BILLARD MARSEILLAIS"]
[null,"TREMEAU PHILIPPE","018691X","N2",0.46800000000000003,"19059--BILLARD CLUB ROQUEBRUNOIS"]
[null,"TROEGNER DANIEL","018722C","N3",0.37,"19059--BILLARD CLUB ROQUEBRUNOIS"]
[null,"TRUCCO DAMIEN","107457Z","N2",0.54400000000000004,"19023--BILLARD CLUB GARDEEN"]
[null,"TRUCCO DOMINIQUE","022448K","N3",0.41699999999999998,"19023--BILLARD CLUB GARDEEN"]
[null,"VALENSI GERARD","022453P","N2",0.49299999999999999,"19017--BILLARD CLUB PHOCEEN"]
[null,"VASSALLUCCI ERIC","136537L","R2",0.16600000000000001,"19017--BILLARD CLUB PHOCEEN"]
[null,"VASSE JEAN PIERRE","129880K","R2",0.13,"19019--BILLARD CLUB DE LA BAIE"]
[null,"VAUTRIN JEAN","022459V","N2",0.379,"19056--BILLARD CLUB DE NICE"]
[null,"VERRIER JEAN PIERRE","125928K","N3",0.41299999999999998,"19012--SALON BILLARD CLUB"]
[null,"VICTOR DANIEL","147412F","R2",0.14699999999999999,"19019--BILLARD CLUB DE LA BAIE"]
[null,"VIERA MAIA ARLINDO","148051A","N2",0.51400000000000001,"19061--ACAD.BILLARD ST RAPHAEL"]
[null,"VIERA MAIA DOUBLON ARLINDO","106901P","N2",0.55100000000000005,"19061--ACAD.BILLARD ST RAPHAEL"]
[null,"VIGNE PHILIPPE","014327B","N1",0.60599999999999998,"19014--BILLARD CLUB AVIGNONNAIS"]
[null,"VILLASEVIL ANTONIO","101485H","N2",0.46899999999999997,"19090--BILLARD AMATEUR ROGNAC"]
[null,"VIOU GERARD","147607S","N3",0.33600000000000002,"19098--BILLARD CLUB LA FARE"]
[null,"VITALIEN PIERRE","119674W","R1",0.28799999999999998,"19016--BILLARD CLUB ORANGEOIS"]
[null,"VIVALDI ANDRE","022476M","N3",0.39900000000000002,"19106--BILLARD CLUB VINONNAIS"]
[null,"VO DANG HUY","132515T","N1",0.83,"19056--BILLARD CLUB DE NICE"]
[null,"VUILLERMET PIERRE","112318Y","R1",0.28499999999999998,"19098--BILLARD CLUB LA FARE"]
[null,"VULTAGGIO PIERRE","022480Q","R1",0.29599999999999999,"19058--ACADEMIE DE BILLARD DE BARBOSSI MANDELIEU"]
[null,"WARIN ALAIN","138807T","R2",0.155,"19016--BILLARD CLUB ORANGEOIS"]
[null,"WARLET JEAN CLAUDE","117872O","N2",0.53500000000000003,"19059--BILLARD CLUB ROQUEBRUNOIS"]
[null,"WILLETTE MARC","022483T","N3",0.26,"19009--CLUB BILLARD ISTREEN"]
[null,"WOILLEZ FRANCIS","101283N","R2",0.16300000000000001,"19014--BILLARD CLUB AVIGNONNAIS"]
[null,"YVOZ CLAUDE","022484U","N3",0.36,"19006--BILLARD CLUB CARPENTRASSIEN"]
[null,"ZOPPI AIME","144788U","N3",0.39300000000000002,"19106--BILLARD CLUB VINONNAIS"]
[null,"ZOPPI CEDRIC","125457H","N1",0.91700000000000004,"19106--BILLARD CLUB VINONNAIS"]

{"sheet":"FICHE-JOUEUR","index":3,"n_rows":413,"n_cols":3,"rows_kept":413,"cut":false,"hidden":true,"merged":[[0,0,0,2]]}
["LMB \nFICHE JOUEURS\n"]
["Licence","NOM","PRENOM"]
["106287Z","ABAD","YANNICK"]
["169265J","ABDALLAH","ANTHONY"]
["159403P","ABELA","JOSEPH"]
["169267L","ACOCA","WILLIAM"]
["147622J","ESTABLIER","PIERRE"]
["165301A","BARTH","JEAN PAUL"]
["021810W","AKNIN","GABRIEL"]
["147980Y","AKTAS","JEAN"]
["149448T","ALESSI","JEAN PIERRE"]
["169144C","ALEXANIAN","ANTOINE"]
["151459E","ALIBERT","BRUNO"]
["159130S","ALVAREZ","PHILIPPE"]
["152035F","ALVISET","GUY"]
["155531F","AMOUROUX","LUC"]
["162879S","AMOUROUX","JACQUES ANTOINE"]
["153111A","ANDRIEUX","STEPHANE"]
["021818E","ANDRY","JEAN FRANCOIS"]
["021819F","ANGUE","PATRICK"]
["021820G","ANNESTAY","JACQUES"]
["021821H","ANTONIN","ALAIN"]
["021824K","ARBAUD","STEPHANE"]
["166320H","ATHLANI","MICHEL"]
["106513R","AUDIBERT","JEAN PIERRE"]
["138454E","AUDOUIN","JEAN JACQUES"]
["012464K","AZERAD","HUGO"]
["021839Z","AZOULAY","ALAIN"]
["115304U","BAILLON","JEAN"]
["153554G","BALESTRI","MAURICE"]
["023184S","BALLIGAND","SERGE"]
["109917P","BARBANNEAU","FREDERIC"]
["018535X","BARDET","JEAN PIERRE"]
["122300W","BARRALLON","JEAN PAUL"]
["115343H","BARTOLETTI","JULIEN"]
["129911P","BASSIGNANA","ROBERT"]
["103568K","BASSOUL","JEAN MARIE"]
["021860U","BAYARD","JEAN CLAUDE"]
["153113C","BECQ","GILLES"]
["021865Z","BELHASSEN","BENJAMIN"]
["132789H","BELTRITTI","JEAN YVES"]
["021872G","BENAVIDES","CLAUDE"]
["138275H","BENAVIDES","GERARD"]
["124802C","BENDAVID","KARINE"]
["159238K","BENIER","PATRICK"]
["160011A","BENSAID","NOEL"]
["125945B","BERNAT","JEAN PIERRE"]
["115001D","BERNICHON","PASCAL"]
["159202W","BIARD","ANDRE"]
["168684C","BODET","DENIS"]
["016248Y","BOFFA","BERNARD"]
["168836S","BOLAND","CHRISTIAN"]
["021894C","BONELLO","LUCIEN"]
["150422C","BONNEMAISON","DENIS"]
["101352E","BONNET","JONATHAN"]
["021900I","BONTOUX","MAX"]
["149287T","BORDES","BERNARD"]
["149288V","BORDES","CATHIE"]
["160000N","BOSSOT","JEAN"]
["155529D","BOULANT","CLAUDE"]
["021911T","BOURDELLES","LAURENT"]
["122662U","BOUTILLE","NICOLAS"]
["118665B","BOUTTIER","CHARLES"]
["125921D","BOUTTIER","CAROLINE"]
["149613Y","BOVET","MICHEL"]
["168877M","BOYER","ANNE MARIE"]
["021918A","BREDAT","RENE"]
["152345S","BREPSON","MARTIAL"]
["113104E","BRIAND","ALAIN"]
["021920C","BRIOIT","DOMINIQUE"]
["114733V","BRUANT","SYLVAIN"]
["136581D","BRUNERIE","JEAN LOUIS"]
["117642S","BUFFART","MICHELE"]
["109188O","BUI THAI","NINH"]
["155679R","BURELLI","GEORGES"]
["162877Q","BUROIS","FREDERIQUE"]
["151533K","BURON","JEAN LOUIS"]
["112311R","CACHO","DIDIER"]
["144785R","CAILLAUD","DANIEL"]
["158342L","CALUSIO","J PIERRE"]
["159692D","CANAL","FRANCOIS"]
["021944A","CAO","HUU TUOI"]
["146885L","CARAIL","MICHEL"]
["021946C","CARDINALI","DENIS"]
["101302G","CARPENTRAS","MICHEL"]
["152346T","CARRE","PIERRE"]
["118684U","CESARO","JEAN CLAUDE"]
["161620Z","CHABOUD","JACQUES"]
["021960Q","CHAIX","JOEL"]
["143166K","CHANTEUX","ALAIN"]
["151534L","CHAPLIN","CHRISTIAN"]
["021967X","CHARBIT","JEAN MARC"]
["152655E","CHEVRIER","JACQUES"]
["152831W","CHEVRIER","CAMILLE"]
["160332Z","CHICARD","ALAIN"]
["108854S","CHUZEVILLE","GILLES"]
["168880Q","CLAUDEN","PHILIPPE"]
["129497R","CLEMENT","GERARD"]
["106896K","CLUS","SANDY"]
["012827J","COHEN","RICHARD"]
["166294E","COLOMBET","MARIE"]
["166295F","COLOMBET","MICHEL"]
["166177C","CONTRAIN","JEROME"]
["021985P","COPPIN","JEAN MICHEL"]
["164007T","CORBIN","LUC"]
["106512Q","CORDONNIER","ROGER"]
["148136S","COSTAZ","ALAIN"]
["125938U","COSTE","PHILIPPE"]
["101268Y","COTARD","SANDRINE"]
["119932U","COUPET","PHILIPPE"]
["168287W","COURSAULT","BERNADETTE"]
["168685D","COZETTE","SYLVIE"]
["021996A","CREUZOT","PATRICE"]
["152067Q","CROUZET","JEAN ANDRE"]
["144718C","D ANTONIO","JEROME"]
["126747X","DAMIEN","JACQUES"]
["022002G","DAMON","GERARD"]
["022003H","DAMON","OLIVIER"]
["144640C","DANCARVILLE","GUY"]
["155526A","DAVID","THIERRY"]
["139487X","DE GRYSE","GERARD"]
["140113Z","DE HAAN","PATRICK"]
["163348C","DE LOOSE","FELIX"]
["159371E","DE LUCA","JEREMY"]
["127655V","DE RIGAL","DANIEL"]
["151535M","DE ROOY","PETER"]
["022009N","DEBOS","CHARLES"]
["119889D","DEFFE","MICHEL"]
["020635R","DEFRETIN","JOEL"]
["016772C","DEL MEDICO","JEAN"]
["152184S","DELAIRE","SYLVAIN"]
["166003N","DELAIRE","JEAN PIERRE"]
["022014S","DELATTRE","RAYMOND"]
["166346L","DELUC","BERNARD"]
["168662D","DEMARCQ","JEAN FRANCOIS"]
["159076J","DEMERLIAC","BRUNO"]
["142358I","DESMERO","RAYMOND"]
["115051B","DESWAZIERE","MICHEL"]
["163923C","DETAND","CHRISTIAN"]
["022033L","DHAINAUT","JEAN FRANCOIS"]
["135014W","DI BIN","JEAN MARIE"]
["160331Y","DION","JEAN LOUIS"]
["142363N","DONABEDIAN","DANIEL"]
["022039R","DOS SANTOS","FRANCIS"]
["169123E","DUBOC","BERTRAND"]
["152038J","DUBOURDEAUX","ROBERT"]
["013022W","DUBREUIL","FRANCK"]
["154651Z","DUCA","ALFONSO"]
["138116E","DUFLOT","ALAIN"]
["013037L","DUMET","BRUNO"]
["105621J","DUPUIS","MICHEL"]
["022049B","DURAND","FREDERIC"]
["022050C","DURAND","HERVE"]
["022052E","DUSFOUR","RENE"]
["102285B","DUSSAULE","PIERRE"]
["140809T","EL MEGHARY","MAROUANE"]
["163467G","ELEOUET","DANIEL"]
["162984G","FAISSOLLE","CHRISTELLE"]
["022066S","FAVARIO","CHRISTIAN"]
["022067T","FERAUD","GERARD"]
["129036Y","FERHAT","ACHOUR"]
["013111H","FERNANDEZ","MARC"]
["122658Q","FERRO","PHILIPPE"]
["114481D","FLORENT","CEDRIC"]
["101139Z","FONTAINE","DANY"]
["127035Z","FOREL","PHILIPPE"]
["152014H","FORGET","LIONEL"]
["022082I","FOSSATI","BRUNO"]
["022084K","FRANCO","GILBERT"]
["118688Y","FRANCO","HENRY"]
["167290M","FROMEYER","CORINNE"]
["159060R","FURNON","ROGER"]
["103216W","GABETTO","STEPHANE"]
["142316S","GALARDINI","RICHARD"]
["145236A","GAMBINO","NATHAN"]
["147288W","GAMEN","ANDRE"]
["022097X","GATTO","ANTOINE"]
["112833T","GAUCHER","JULIEN"]
["116278G","GAVALDA","PIERRE"]
["125944A","GAVANON","ANDRE"]
["163279C","GELAS","BERNARD"]
["150065P","GENDRAUD","PHILIPPE"]
["022103D","GERARD","PASCAL"]
["167330F","GERARD","THOMAS"]
["022104E","GERVAIS","GUILLAUME"]
["101282M","GHU","GERARD"]
["022108I","GIANNATTASIO","LUCIEN"]
["118661X","GIBARROUX","CHRISTOPHE"]
["149390F","GIFFARD","PHILIPPE"]
["022113N","GIMENEZ","SERGE"]
["022115P","GIOVANNETTI","DAMIEN"]
["129718E","GIRARD","JACQUES"]
["159240M","GLEISES","CHRISTIAN"]
["022120U","GLEIZES","JEAN"]
["157852D","GODARD","PASCAL"]
["131925B","GOUDENECHE","BERNARD"]
["022129D","GOUIRAN","GEORGES"]
["104054C","GOURSEAUD","YVES"]
["101259P","GOUZIEN","RENAUD"]
["166216V","GOUZIEN","YANN"]
["144636Y","GOUZOUGUEN","CHRISTIAN"]
["163514H","GRANDMAIRE","ROLAND"]
["149576H","GREGOIRE","J CLAUDE"]
["022132G","GRIFFON","JEAN JACQUES"]
["101403D","GROS","ROLAND"]
["107059R","GROS","MARIE PAULE"]
["135013V","GUERI","ROBERT"]
["103615F","GUERIN","RAYMOND"]
["022135J","GUERINEAU","THIERRY"]
["144796C","GUERINEAU","BRUNO"]
["104475H","GUEUG","PIERRE"]
["022137L","GUIBERT","JEAN MARIE"]
["109714U","HAEBERLE","JEAN"]
["011966G","HAHN","DANIEL"]
["022141P","HAROUTUNIAN","PIERRE"]
["166328R","HARTENSTEIN","BRUNO"]
["137523J","HAZE","PATRICK"]
["119933V","HERREMAN","SERGE"]
["137004K","HEURTAULT","JACKY"]
["163015Q","HUREL","JACQUES"]
["148913M","HURSTEL","BERNARD"]
["169266K","JANNOT","FREDERIC"]
["120276A","JAVEY","JEAN FRANCOIS"]
["022163L","JOB","GEORGES"]
["120814S","JONNARD","FREDERIC"]
["109412E","JUIGNET","CHRISTIAN"]
["162905W","JUMEL","RENE"]
["125930M","LABBE","CLAUDE"]
["109977X","LACOSSE","JEAN PAUL"]
["168708D","LACROIX","JEAN MARC"]
["168256M","LAFON","CHARLES"]
["016084Q","LANDE","GERARD"]
["168288X","LANNURIEN","THIERRY"]
["022190M","LAPLANCHE","YVON"]
["022195R","LAVASTROU","ROGER"]
["163278B","LE FAUCHEUR","LAURENT"]
["125949F","LE GUENNEC","CHRISTIAN"]
["120278C","LE MEUR","CLAUDE"]
["013510Q","LE RAY","JEAN CLAUDE"]
["141504M","LECOQ","ARNAUD"]
["117411V","LEFAUX","JEAN JACQUES"]
["110379J","LEMARTINET","ROBERT"]
["022205B","LEMESLE","FABRICE"]
["104233Z","LEMIERE","JEAN NOEL"]
["022209F","LIEGEOIS","DOMINIQUE"]
["159203X","LINA","SERGE"]
["146375V","LISI","ROGER"]
["168722T","LISSAJOUX","JEAN CLAUDE"]
["166755F","LOPEZ","TONY"]
["169129L","LORION","PHILIPPE"]
["022217N","LORKOVIC","JOSEPH"]
["168030R","LOSTAO","DOMINIQUE"]
["162076V","LUCENET","PAUL"]
["022221R","LUVISON","JEAN"]
["022223T","MACQUET","PATRICK"]
["165843P","MAGNIER","PIERRE"]
["114884Q","MAGNIEZ","JACQUES"]
["100910E","MALLEVAL","GERARD"]
["159667B","MALPAUX","GUY"]
["022229Z","MANZOLI","ANGELO"]
["101260Q","MARIOTTI","JEAN MICHEL"]
["159950J","MARME","HANS"]
["103581X","MASSERAN","PHILIPPE"]
["129498S","MATHIEU","CLAUDE"]
["017615N","MAUDUIT","DIDIER"]
["149391G","MAURON","BERNARD"]
[112015,"MAYNARD","ALEXANDRE"]
["163410V","MEALLIER","LOLA"]
["165932L","MEALLIER","RAPHAEL"]
["128466A","MEGUIN","ERIC"]
["144802I","MELLET","PIERRE"]
["152604Z","METAIS","ALBAN"]
["022260E","MEYER","LUC"]
["144792Y","MISRAKI","ROMAIN"]
["022266K","MOGLIA","EMILE"]
["167147G","MOLINA","MARIE"]
["022270O","MOLINAS","ROBERT"]
["022271P","MONNET","JEAN CLAUDE"]
["147624L","MOREELS","BERNARD"]
["151456B","MOUSSIER","PATRICK"]
["109063T","MUNOS","JEAN"]
["141788K","N GUYEN VAN DUC","MAX"]
["123392W","NARDI","LOUIS"]
["107263N","NASICA","PATRICK"]
["101269Z","NATALI","MICHEL"]
["154572N","NATELLA","ROGER"]
["154573P","NATELLA","IDA"]
["168689H","NAVARRO","BERNARD"]
["132345F","NEICHTHAUSER","GERARD"]
["128204Y","NICOLAS","JOEL"]
["146143X","NICOLE","CLAUDE"]
["154378C","ORSAL","SERGE"]
["128468C","OUDOUX","GERARD"]
["150400D","PACZESNY","FABRICE"]
["141673Z","PELLAT","FRANCIS"]
["144779L","PELOUIN","JEAN FRANCOIS"]
["103577T","PENEDO","MANUEL"]
["102907Z","PERDICARO","CAMILLE"]
["013896M","PEREIRA","CHARLES"]
["130773T","PEREZ","CHRISTIAN"]
["159241N","PEREZ","JEAN PIERRE"]
["022321N","PERIS","MICHEL"]
["150544K","PERRE","OLIVIER"]
["166927S","PEYRAN","PATRICE"]
["151709B","PIATEK","JEAN CLAUDE"]
["135135N","PICCHI","GERARD"]
["022330W","PIELIN","PASCAL"]
["112316W","PIGNATEL","FLORENT"]
["105404A","PINARD","PATRICE"]
["022336C","PIQUET","VICTOR"]
["111987F","PLAQUEVENT","ROMUALD"]
["108010G","POIRIER","DOMINIQUE"]
["022347N","POUJOL","JEAN PAUL"]
["144719D","POULAIN","FREDERIC"]
["022349P","POZNANSKI","JEAN MICHEL"]
["136544S","QUEZEL","ANDRE"]
["101290U","RANIERI","JEAN ANDRE"]
["163826X","RATON","PATRICE"]
["159200T","REGNOUARD","MICHEL"]
["133622I","RENAUD","JEAN PAUL"]
["119696S","REVALOR","MICHEL"]
["022366G","RIBOLLA","PATRICE"]
["022367H","RICHARD","GUY"]
["169268M","RIETTE","MARJORIE"]
["125943Z","RIFFET","BERNARD"]
["022372M","RIGNOLS","PHILIPPE"]
["134183X","ROBBE","RAYMOND"]
["022376Q","ROBERT","DOMINIQUE"]
["022450M","ROBERT","DIDIER"]
["169274T","ROCA","STEPHANIE"]
["103608Y","RODRIGUEZ","STEPHAN"]
["163945B","RODRIGUEZ","RONNIE"]
["134843H","ROGER","GERARD"]
["166175A","RONSSAIN","JEAN JACQUES"]
["166176B","ROTH","ALAIN"]
["101518O","ROUGON","ROBERT"]
["163989Z","ROUSSEL","ALAIN"]
["022384Y","ROUX","CLAUDE"]
["122208I","SABLON","ROGER"]
["169318R","SAFI","AZIZ"]
["136546U","SALAMA","ALAIN"]
["120008S","SAMUEL","CHRISTIAN"]
["163352G","SANCHEZ PEREZ","FRANCISCO"]
["167423G","SANTANA","ELOY"]
["022391F","SANTIAGO","JEAN JOSEPH"]
["022393H","SANTORO","ROBERT"]
["014138U","SARRALDE","LOUIS"]
["164008V","SAUVAN","HENRY"]
["144798E","SAUZE","DENIS"]
["113222S","SAVOIA","PATRICK"]
["149694L","SCHAEFER","ERNEST ROBERT"]
["136540O","SCHENK","ROBERT"]
["167170G","SEJOURNE","LAURENT"]
["022406U","SELLIER","MICHEL"]
["155543T","SEREAULT","CLAUDE"]
["149899J","SERMON","FABIO"]
["148608F","SEYNHAEVE","BAUDOUIN"]
["163238H","SICARD","GEORGES"]
["168834Q","SIEGLER","JEAN PIERRE"]
["165933M","SIMANTOB","JEAN LUC"]
["156378B","SIMIAN","FABIENNE"]
["010203L","SIMON","GERARD"]
["022412A","SINANIAN","JEAN PAUL"]
["151274D","SOLARI","ANNICK"]
["151275E","SOLARI","GERARD"]
["103578U","SOLTANI","OMAR"]
["162906X","SOUCHERE","JEAN JACQUES"]
["149696N","SOUTEYRAND","CHRISTIAN"]
["165931K","SPINNLER","JEAN LUC"]
["020790Q","STEINMANN","SEBASTIEN"]
["156278S","STRAUDO","MICHEL"]
["165039Q","SUEUR","PASCAL"]
["143055D","TABUADA","FRANCOIS"]
["022429R","TARDIEUX","LUC"]
["133907H","TARDY","JEAN CLAUDE"]
["143024Y","TARDY","PIERRE YVES"]
["123701T","TELOT","DOMINIQUE"]
["168687F","THOMAS","PHILIPPE"]
["148252T","TIMSIT","SERGE"]
["131820A","TONINI BOSSI","LAURENT"]
["132786E","TONNELIER","JEAN PIERRE"]
["135554Q","TORES","JEAN LUC"]
["014256I","TOURE","MADOU"]
["139062O","TOUREILLE","ALAIN"]
["022441D","TOURET","THIERRY"]
["022443F","TRAN","KEVIN"]
["131929F","TRAN DINH","VUONG"]
["138277J","TRAPPE","JEAN MARIE"]
["022446I","TRIVINO","RENE"]
["107282G","VAHE","GUILLAUME"]
["139591X","VAN HACK","DIDIER"]
["022456S","VASCONE","JOHNY"]
["129880K","VASSE","JEAN PIERRE"]
["022459V","VAUTRIN","JEAN"]
["022466C","VIALATTE","ANDRE"]
["166670N","VIAN","MORGAN"]
["022467D","VIBOUREL","ETIENNE"]
["147412F","VICTOR","DANIEL"]
["148051A","VIERA MAIA","ARLINDO"]
["164317F","VILLARD","PATRICE"]
["101485H","VILLASEVIL","ANTONIO"]
["153007M","VILLEMAIN","SYLVAIN"]
["147607S","VIOU","GERARD"]
["138731V","VISCONTI","JEAN"]
["119674W","VITALIEN","PIERRE"]
["022476M","VIVALDI","ANDRE"]
["154571M","VUILLAUME","JEAN CLAUDE"]
["014349X","WEINER","GUY"]
["143308W","YORAC","ARNOLF"]
["166159H","YUNG","NADEGE"]
["134311V","ZANDRINO","ALAIN"]
["125457H","ZOPPI","CEDRIC"]
["144788U","ZOPPI","AIME"]

{"sheet":"Saisie des joueurs","index":4,"n_rows":42,"n_cols":15,"rows_kept":42,"cut":false,"hidden":false,"merged":[[0,2,1,6],[2,2,2,6],[41,2,41,3],[14,10,14,14],[4,4,8,6],[15,2,15,6],[15,10,15,14],[10,3,10,4],[12,2,12,6],[14,2,14,6]]}
[null,null,"LIGUE MEDITERRANEENNE DE BILLARD"]
[null,null,null,null,null,null,null,"Mis à jour le 26/09/2023"]
[null,null,"Saisir ici les informations concernant le tournoi."]
[]
[null,null,"Date  (jj/mm/aa)"]
[]
[null,null,"Nom de la compétition","T1"]
[]
[null,null,"Mode de jeu","3 BANDES"]
[]
[null,null,"Club organisateur",null,null,"Directeur de jeu"]
[]
[null,null,"TOURNOI 2KO A 24 JOUEURS - 4 BILLARDS"]
[]
[null,null,"Dans cet onglet \"Saisir dans la liste déroulante les NOMS  des joueurs de cette Colonne\", l'ordre à saisir n'est pas important :\nMettre JOUEUR \"ABSENT\" sur les cases vides restantes, ensuite cliquer sur le \"BOUTON TRI \"",null,null,null,null,null,null,null,"RESULTAT DU TRI"]
[null,null,"Ne Pas toucher au cellules ci-dessous",null,null,null,null,null,null,null,"Ne Pas toucher au cellules ci-dessous"]
["N°","Liste déroulante NOM ","N° Licence","NOM PRENOM","Catégorie","Moyenne 3,10","Club",null,null,"N°","Licences","NOM PRENOM","Catégorie","Moyenne 3,10","Club"]
[{"$f":"ROW(A1)","v":1},null,{"$f":"IF(B18<>\"\",VLOOKUP(B18,DONNEES!$B$4:$F$414,2,FALSE),\"\")","v":""},{"$f":"IF(B18<>\"\",VLOOKUP(B18,DONNEES!$B$4:$F$414,1,FALSE),\"\")","v":""},{"$f":"IF(B18<>\"\",VLOOKUP(B18,DONNEES!$B$4:$F$414,3,FALSE),\"z\")","v":"z"},{"$f":"IF(B18<>\"\",VLOOKUP(B18,DONNEES!$B$4:$F$414,4,FALSE),\"\")","v":""},{"$f":"IF(B18<>\"\",VLOOKUP(B18,DONNEES!$B$4:$F$414,5,FALSE),\"\")","v":""},null,null,{"$f":"ROW(J1)","v":1},"","","z","",""]
[{"$f":"ROW(A2)","v":2},null,{"$f":"IF(B19<>\"\",VLOOKUP(B19,DONNEES!$B$4:$F$414,2,FALSE),\"\")","v":""},{"$f":"IF(B19<>\"\",VLOOKUP(B19,DONNEES!$B$4:$F$414,1,FALSE),\"\")","v":""},{"$f":"IF(B19<>\"\",VLOOKUP(B19,DONNEES!$B$4:$F$414,3,FALSE),\"z\")","v":"z"},{"$f":"IF(B19<>\"\",VLOOKUP(B19,DONNEES!$B$4:$F$414,4,FALSE),\"\")","v":""},{"$f":"IF(B19<>\"\",VLOOKUP(B19,DONNEES!$B$4:$F$414,5,FALSE),\"\")","v":""},null,null,{"$f":"ROW(J2)","v":2},"","","z","",""]
[3,null,{"$f":"IF(B20<>\"\",VLOOKUP(B20,DONNEES!$B$4:$F$414,2,FALSE),\"\")","v":""},{"$f":"IF(B20<>\"\",VLOOKUP(B20,DONNEES!$B$4:$F$414,1,FALSE),\"\")","v":""},{"$f":"IF(B20<>\"\",VLOOKUP(B20,DONNEES!$B$4:$F$414,3,FALSE),\"z\")","v":"z"},{"$f":"IF(B20<>\"\",VLOOKUP(B20,DONNEES!$B$4:$F$414,4,FALSE),\"\")","v":""},{"$f":"IF(B20<>\"\",VLOOKUP(B20,DONNEES!$B$4:$F$414,5,FALSE),\"\")","v":""},null,null,3,"","","z","",""]
[4,null,{"$f":"IF(B21<>\"\",VLOOKUP(B21,DONNEES!$B$4:$F$414,2,FALSE),\"\")","v":""},{"$f":"IF(B21<>\"\",VLOOKUP(B21,DONNEES!$B$4:$F$414,1,FALSE),\"\")","v":""},{"$f":"IF(B21<>\"\",VLOOKUP(B21,DONNEES!$B$4:$F$414,3,FALSE),\"z\")","v":"z"},{"$f":"IF(B21<>\"\",VLOOKUP(B21,DONNEES!$B$4:$F$414,4,FALSE),\"\")","v":""},{"$f":"IF(B21<>\"\",VLOOKUP(B21,DONNEES!$B$4:$F$414,5,FALSE),\"\")","v":""},null,null,4,"","","z","",""]
[5,null,{"$f":"IF(B22<>\"\",VLOOKUP(B22,DONNEES!$B$4:$F$414,2,FALSE),\"\")","v":""},{"$f":"IF(B22<>\"\",VLOOKUP(B22,DONNEES!$B$4:$F$414,1,FALSE),\"\")","v":""},{"$f":"IF(B22<>\"\",VLOOKUP(B22,DONNEES!$B$4:$F$414,3,FALSE),\"z\")","v":"z"},{"$f":"IF(B22<>\"\",VLOOKUP(B22,DONNEES!$B$4:$F$414,4,FALSE),\"\")","v":""},{"$f":"IF(B22<>\"\",VLOOKUP(B22,DONNEES!$B$4:$F$414,5,FALSE),\"\")","v":""},null,null,5,"","","z","",""]
[6,null,{"$f":"IF(B23<>\"\",VLOOKUP(B23,DONNEES!$B$4:$F$414,2,FALSE),\"\")","v":""},{"$f":"IF(B23<>\"\",VLOOKUP(B23,DONNEES!$B$4:$F$414,1,FALSE),\"\")","v":""},{"$f":"IF(B23<>\"\",VLOOKUP(B23,DONNEES!$B$4:$F$414,3,FALSE),\"z\")","v":"z"},{"$f":"IF(B23<>\"\",VLOOKUP(B23,DONNEES!$B$4:$F$414,4,FALSE),\"\")","v":""},{"$f":"IF(B23<>\"\",VLOOKUP(B23,DONNEES!$B$4:$F$414,5,FALSE),\"\")","v":""},null,null,6,"","","z","",""]
[7,null,{"$f":"IF(B24<>\"\",VLOOKUP(B24,DONNEES!$B$4:$F$414,2,FALSE),\"\")","v":""},{"$f":"IF(B24<>\"\",VLOOKUP(B24,DONNEES!$B$4:$F$414,1,FALSE),\"\")","v":""},{"$f":"IF(B24<>\"\",VLOOKUP(B24,DONNEES!$B$4:$F$414,3,FALSE),\"z\")","v":"z"},{"$f":"IF(B24<>\"\",VLOOKUP(B24,DONNEES!$B$4:$F$414,4,FALSE),\"\")","v":""},{"$f":"IF(B24<>\"\",VLOOKUP(B24,DONNEES!$B$4:$F$414,5,FALSE),\"\")","v":""},null,null,7,"","","z","",""]
[8,null,{"$f":"IF(B25<>\"\",VLOOKUP(B25,DONNEES!$B$4:$F$414,2,FALSE),\"\")","v":""},{"$f":"IF(B25<>\"\",VLOOKUP(B25,DONNEES!$B$4:$F$414,1,FALSE),\"\")","v":""},{"$f":"IF(B25<>\"\",VLOOKUP(B25,DONNEES!$B$4:$F$414,3,FALSE),\"z\")","v":"z"},{"$f":"IF(B25<>\"\",VLOOKUP(B25,DONNEES!$B$4:$F$414,4,FALSE),\"\")","v":""},{"$f":"IF(B25<>\"\",VLOOKUP(B25,DONNEES!$B$4:$F$414,5,FALSE),\"\")","v":""},null,null,8,"","","z","",""]
[9,null,{"$f":"IF(B26<>\"\",VLOOKUP(B26,DONNEES!$B$4:$F$414,2,FALSE),\"\")","v":""},{"$f":"IF(B26<>\"\",VLOOKUP(B26,DONNEES!$B$4:$F$414,1,FALSE),\"\")","v":""},{"$f":"IF(B26<>\"\",VLOOKUP(B26,DONNEES!$B$4:$F$414,3,FALSE),\"z\")","v":"z"},{"$f":"IF(B26<>\"\",VLOOKUP(B26,DONNEES!$B$4:$F$414,4,FALSE),\"\")","v":""},{"$f":"IF(B26<>\"\",VLOOKUP(B26,DONNEES!$B$4:$F$414,5,FALSE),\"\")","v":""},null,null,9,"","","z","",""]
[10,null,{"$f":"IF(B27<>\"\",VLOOKUP(B27,DONNEES!$B$4:$F$414,2,FALSE),\"\")","v":""},{"$f":"IF(B27<>\"\",VLOOKUP(B27,DONNEES!$B$4:$F$414,1,FALSE),\"\")","v":""},{"$f":"IF(B27<>\"\",VLOOKUP(B27,DONNEES!$B$4:$F$414,3,FALSE),\"z\")","v":"z"},{"$f":"IF(B27<>\"\",VLOOKUP(B27,DONNEES!$B$4:$F$414,4,FALSE),\"\")","v":""},{"$f":"IF(B27<>\"\",VLOOKUP(B27,DONNEES!$B$4:$F$414,5,FALSE),\"\")","v":""},null,null,10,"","","z","",""]
[11,null,{"$f":"IF(B28<>\"\",VLOOKUP(B28,DONNEES!$B$4:$F$414,2,FALSE),\"\")","v":""},{"$f":"IF(B28<>\"\",VLOOKUP(B28,DONNEES!$B$4:$F$414,1,FALSE),\"\")","v":""},{"$f":"IF(B28<>\"\",VLOOKUP(B28,DONNEES!$B$4:$F$414,3,FALSE),\"z\")","v":"z"},{"$f":"IF(B28<>\"\",VLOOKUP(B28,DONNEES!$B$4:$F$414,4,FALSE),\"\")","v":""},{"$f":"IF(B28<>\"\",VLOOKUP(B28,DONNEES!$B$4:$F$414,5,FALSE),\"\")","v":""},null,null,11,"","","z","",""]
[12,null,{"$f":"IF(B29<>\"\",VLOOKUP(B29,DONNEES!$B$4:$F$414,2,FALSE),\"\")","v":""},{"$f":"IF(B29<>\"\",VLOOKUP(B29,DONNEES!$B$4:$F$414,1,FALSE),\"\")","v":""},{"$f":"IF(B29<>\"\",VLOOKUP(B29,DONNEES!$B$4:$F$414,3,FALSE),\"z\")","v":"z"},{"$f":"IF(B29<>\"\",VLOOKUP(B29,DONNEES!$B$4:$F$414,4,FALSE),\"\")","v":""},{"$f":"IF(B29<>\"\",VLOOKUP(B29,DONNEES!$B$4:$F$414,5,FALSE),\"\")","v":""},null,null,12,"","","z","",""]
[13,null,{"$f":"IF(B30<>\"\",VLOOKUP(B30,DONNEES!$B$4:$F$414,2,FALSE),\"\")","v":""},{"$f":"IF(B30<>\"\",VLOOKUP(B30,DONNEES!$B$4:$F$414,1,FALSE),\"\")","v":""},{"$f":"IF(B30<>\"\",VLOOKUP(B30,DONNEES!$B$4:$F$414,3,FALSE),\"z\")","v":"z"},{"$f":"IF(B30<>\"\",VLOOKUP(B30,DONNEES!$B$4:$F$414,4,FALSE),\"\")","v":""},{"$f":"IF(B30<>\"\",VLOOKUP(B30,DONNEES!$B$4:$F$414,5,FALSE),\"\")","v":""},null,null,13,"","","z","",""]
[14,null,{"$f":"IF(B31<>\"\",VLOOKUP(B31,DONNEES!$B$4:$F$414,2,FALSE),\"\")","v":""},{"$f":"IF(B31<>\"\",VLOOKUP(B31,DONNEES!$B$4:$F$414,1,FALSE),\"\")","v":""},{"$f":"IF(B31<>\"\",VLOOKUP(B31,DONNEES!$B$4:$F$414,3,FALSE),\"z\")","v":"z"},{"$f":"IF(B31<>\"\",VLOOKUP(B31,DONNEES!$B$4:$F$414,4,FALSE),\"\")","v":""},{"$f":"IF(B31<>\"\",VLOOKUP(B31,DONNEES!$B$4:$F$414,5,FALSE),\"\")","v":""},null,null,14,"","","z","",""]
[15,null,{"$f":"IF(B32<>\"\",VLOOKUP(B32,DONNEES!$B$4:$F$414,2,FALSE),\"\")","v":""},{"$f":"IF(B32<>\"\",VLOOKUP(B32,DONNEES!$B$4:$F$414,1,FALSE),\"\")","v":""},{"$f":"IF(B32<>\"\",VLOOKUP(B32,DONNEES!$B$4:$F$414,3,FALSE),\"z\")","v":"z"},{"$f":"IF(B32<>\"\",VLOOKUP(B32,DONNEES!$B$4:$F$414,4,FALSE),\"\")","v":""},{"$f":"IF(B32<>\"\",VLOOKUP(B32,DONNEES!$B$4:$F$414,5,FALSE),\"\")","v":""},null,null,15,"","","z","",""]
[16,null,{"$f":"IF(B33<>\"\",VLOOKUP(B33,DONNEES!$B$4:$F$414,2,FALSE),\"\")","v":""},{"$f":"IF(B33<>\"\",VLOOKUP(B33,DONNEES!$B$4:$F$414,1,FALSE),\"\")","v":""},{"$f":"IF(B33<>\"\",VLOOKUP(B33,DONNEES!$B$4:$F$414,3,FALSE),\"z\")","v":"z"},{"$f":"IF(B33<>\"\",VLOOKUP(B33,DONNEES!$B$4:$F$414,4,FALSE),\"\")","v":""},{"$f":"IF(B33<>\"\",VLOOKUP(B33,DONNEES!$B$4:$F$414,5,FALSE),\"\")","v":""},null,null,16,"","","z","",""]
[17,null,{"$f":"IF(B34<>\"\",VLOOKUP(B34,DONNEES!$B$4:$F$414,2,FALSE),\"\")","v":""},{"$f":"IF(B34<>\"\",VLOOKUP(B34,DONNEES!$B$4:$F$414,1,FALSE),\"\")","v":""},{"$f":"IF(B34<>\"\",VLOOKUP(B34,DONNEES!$B$4:$F$414,3,FALSE),\"z\")","v":"z"},{"$f":"IF(B34<>\"\",VLOOKUP(B34,DONNEES!$B$4:$F$414,4,FALSE),\"\")","v":""},{"$f":"IF(B34<>\"\",VLOOKUP(B34,DONNEES!$B$4:$F$414,5,FALSE),\"\")","v":""},null,null,17,"","","z","",""]
[18,null,{"$f":"IF(B35<>\"\",VLOOKUP(B35,DONNEES!$B$4:$F$414,2,FALSE),\"\")","v":""},{"$f":"IF(B35<>\"\",VLOOKUP(B35,DONNEES!$B$4:$F$414,1,FALSE),\"\")","v":""},{"$f":"IF(B35<>\"\",VLOOKUP(B35,DONNEES!$B$4:$F$414,3,FALSE),\"z\")","v":"z"},{"$f":"IF(B35<>\"\",VLOOKUP(B35,DONNEES!$B$4:$F$414,4,FALSE),\"\")","v":""},{"$f":"IF(B35<>\"\",VLOOKUP(B35,DONNEES!$B$4:$F$414,5,FALSE),\"\")","v":""},null,null,18,"","","z","",""]
[19,null,{"$f":"IF(B36<>\"\",VLOOKUP(B36,DONNEES!$B$4:$F$414,2,FALSE),\"\")","v":""},{"$f":"IF(B36<>\"\",VLOOKUP(B36,DONNEES!$B$4:$F$414,1,FALSE),\"\")","v":""},{"$f":"IF(B36<>\"\",VLOOKUP(B36,DONNEES!$B$4:$F$414,3,FALSE),\"z\")","v":"z"},{"$f":"IF(B36<>\"\",VLOOKUP(B36,DONNEES!$B$4:$F$414,4,FALSE),\"\")","v":""},{"$f":"IF(B36<>\"\",VLOOKUP(B36,DONNEES!$B$4:$F$414,5,FALSE),\"\")","v":""},null,null,19,"","","z","",""]
[20,null,{"$f":"IF(B37<>\"\",VLOOKUP(B37,DONNEES!$B$4:$F$414,2,FALSE),\"\")","v":""},{"$f":"IF(B37<>\"\",VLOOKUP(B37,DONNEES!$B$4:$F$414,1,FALSE),\"\")","v":""},{"$f":"IF(B37<>\"\",VLOOKUP(B37,DONNEES!$B$4:$F$414,3,FALSE),\"z\")","v":"z"},{"$f":"IF(B37<>\"\",VLOOKUP(B37,DONNEES!$B$4:$F$414,4,FALSE),\"\")","v":""},{"$f":"IF(B37<>\"\",VLOOKUP(B37,DONNEES!$B$4:$F$414,5,FALSE),\"\")","v":""},null,null,20,"","","z","",""]
[21,null,{"$f":"IF(B38<>\"\",VLOOKUP(B38,DONNEES!$B$4:$F$414,2,FALSE),\"\")","v":""},{"$f":"IF(B38<>\"\",VLOOKUP(B38,DONNEES!$B$4:$F$414,1,FALSE),\"\")","v":""},{"$f":"IF(B38<>\"\",VLOOKUP(B38,DONNEES!$B$4:$F$414,3,FALSE),\"z\")","v":"z"},{"$f":"IF(B38<>\"\",VLOOKUP(B38,DONNEES!$B$4:$F$414,4,FALSE),\"\")","v":""},{"$f":"IF(B38<>\"\",VLOOKUP(B38,DONNEES!$B$4:$F$414,5,FALSE),\"\")","v":""},null,null,21,"","","z","",""]
[22,null,{"$f":"IF(B39<>\"\",VLOOKUP(B39,DONNEES!$B$4:$F$414,2,FALSE),\"\")","v":""},{"$f":"IF(B39<>\"\",VLOOKUP(B39,DONNEES!$B$4:$F$414,1,FALSE),\"\")","v":""},{"$f":"IF(B39<>\"\",VLOOKUP(B39,DONNEES!$B$4:$F$414,3,FALSE),\"z\")","v":"z"},{"$f":"IF(B39<>\"\",VLOOKUP(B39,DONNEES!$B$4:$F$414,4,FALSE),\"\")","v":""},{"$f":"IF(B39<>\"\",VLOOKUP(B39,DONNEES!$B$4:$F$414,5,FALSE),\"\")","v":""},null,null,22,"","","z","",""]
[23,null,{"$f":"IF(B40<>\"\",VLOOKUP(B40,DONNEES!$B$4:$F$414,2,FALSE),\"\")","v":""},{"$f":"IF(B40<>\"\",VLOOKUP(B40,DONNEES!$B$4:$F$414,1,FALSE),\"\")","v":""},{"$f":"IF(B40<>\"\",VLOOKUP(B40,DONNEES!$B$4:$F$414,3,FALSE),\"z\")","v":"z"},{"$f":"IF(B40<>\"\",VLOOKUP(B40,DONNEES!$B$4:$F$414,4,FALSE),\"\")","v":""},{"$f":"IF(B40<>\"\",VLOOKUP(B40,DONNEES!$B$4:$F$414,5,FALSE),\"\")","v":""},null,null,23,"","","z","",""]
[24,null,{"$f":"IF(B41<>\"\",VLOOKUP(B41,DONNEES!$B$4:$F$414,2,FALSE),\"\")","v":""},{"$f":"IF(B41<>\"\",VLOOKUP(B41,DONNEES!$B$4:$F$414,1,FALSE),\"\")","v":""},{"$f":"IF(B41<>\"\",VLOOKUP(B41,DONNEES!$B$4:$F$414,3,FALSE),\"z\")","v":"z"},{"$f":"IF(B41<>\"\",VLOOKUP(B41,DONNEES!$B$4:$F$414,4,FALSE),\"\")","v":""},{"$f":"IF(B41<>\"\",VLOOKUP(B41,DONNEES!$B$4:$F$414,5,FALSE),\"\")","v":""},null,null,24,"","","z","",""]
[null,null,"™A.FERHAT ™ C.PEREZ",null,null,null,null,null,null,null,"™A.FERHAT ™ C.PEREZ"]

{"sheet":"GRAPHIQUE 24J","index":5,"n_rows":50,"n_cols":99,"rows_kept":50,"cut":false,"hidden":false,"merged":[[46,26,46,35],[35,80,36,80],[34,23,35,23],[34,40,35,40],[49,26,49,35],[39,70,40,70],[43,26,44,35],[25,3,25,5],[33,3,33,5],[41,3,41,5],[47,26,47,35],[31,4,32,4],[39,4,40,4],[39,19,40,19],[31,19,32,19],[48,26,48,35],[47,1,50,12],[43,1,43,3],[43,5,43,8],[43,16,49,25],[43,40,44,43],[41,53,41,55],[39,54,40,54],[45,26,45,35],[34,77,35,77],[34,60,35,60],[26,60,27,60],[27,26,28,26],[29,62,29,64],[27,63,28,63],[29,25,29,27],[29,42,29,44],[33,41,33,44],[33,35,33,37],[33,69,33,71],[30,67,31,67],[31,70,32,70],[29,33,29,37],[31,36,32,36],[35,26,36,26],[35,43,36,43],[35,63,36,63],[26,8,27,8],[34,8,35,8],[10,8,11,8],[9,41,9,44],[11,26,12,26],[6,40,6,44],[10,40,11,40],[43,10,43,12],[41,69,41,71],[37,33,37,37],[39,36,40,36],[37,67,37,71],[38,67,39,67],[37,51,37,55],[37,16,37,20],[14,16,15,16],[13,33,13,37],[13,10,13,12],[19,26,20,26],[18,23,19,23],[15,36,16,36],[14,33,15,33],[17,35,17,37],[15,54,16,54],[35,11,36,11],[23,19,24,19],[41,18,41,20],[41,35,41,37],[26,23,27,23],[1,1,2,55],[1,60,2,97],[25,69,25,71],[19,63,20,63],[19,80,20,80],[15,96,16,96],[18,77,19,77],[14,93,15,93],[13,2,13,5],[9,9,9,12],[13,16,13,20],[13,67,13,71],[10,93,11,97],[13,93,13,97],[13,85,13,89],[6,51,6,55],[6,60,6,64],[18,8,19,8],[9,61,9,64],[4,77,4,81],[4,85,4,89],[4,67,4,71],[4,60,4,64],[25,53,25,55],[4,1,4,20],[15,4,16,4],[6,1,6,5],[6,8,6,12],[6,16,6,20],[11,11,12,11],[15,88,16,88],[14,85,15,85],[11,80,12,80],[10,77,11,77],[10,60,11,60],[9,24,9,27],[13,79,13,81],[13,62,13,64],[13,42,13,44],[9,77,9,81],[14,1,15,1],[17,24,17,27],[17,41,17,44],[6,93,6,97],[6,33,6,37],[10,23,11,23],[11,63,12,63],[4,23,4,37],[4,40,4,55],[13,25,13,27],[21,79,21,81],[17,77,17,81],[18,60,19,60],[17,69,17,71],[13,51,13,55],[17,87,17,89],[21,62,21,64],[6,23,6,27],[11,43,12,43],[6,67,6,71],[6,77,6,81],[6,85,6,89],[17,95,17,97],[17,61,17,64],[14,67,15,67],[15,70,16,70],[14,51,15,51],[17,18,17,20],[15,19,16,19],[21,10,21,12],[21,25,21,27],[17,53,17,55],[21,33,21,37],[18,1,19,2],[17,3,17,5],[19,3,19,5],[19,43,20,43],[23,4,24,4],[44,77,45,80],[17,9,17,12],[25,9,25,12],[33,9,33,12],[33,77,33,81],[21,67,21,71],[18,40,19,40],[29,79,29,81],[19,11,20,11],[21,16,21,20],[29,51,29,55],[33,61,33,64],[37,10,37,12],[37,25,37,27],[37,42,37,44],[37,62,37,64],[27,11,28,11],[37,79,37,81],[29,10,29,12],[25,24,25,27],[33,24,33,27],[25,41,25,44],[29,16,29,20],[25,18,25,20],[33,18,33,20],[26,93,27,97],[29,93,29,97],[29,85,29,89],[33,95,33,97],[31,88,32,88],[31,54,32,54],[33,53,33,55],[29,67,29,71],[25,77,25,81],[26,77,27,77],[26,40,27,40],[27,43,28,43],[27,80,28,80],[25,61,25,64],[25,35,25,37],[23,70,24,70],[22,67,23,67],[23,36,24,36],[31,96,32,96],[30,85,31,85],[30,93,31,93],[21,42,21,44],[21,51,21,55],[33,87,33,89],[23,54,24,54]]}
[]
[null,"SAMEDI",null,null,null,null,null,null,null,null,null,null,null,null,null,null,null,null,null,null,null,null,null,null,null,null,null,null,null,null,null,null,null,null,null,null,null,null,null,null,null,null,null,null,null,null,null,null,null,null,null,null,null,null,null,null,null,null,null,null,"DIMANCHE"]
[]
[]
[null,"PHASE 1  DISTANCES 1",null,null,null,null,null,null,null,null,null,null,null,null,null,null,null,null,null,null,null,null,null,"PHASE 2  DISTANCES 1",null,null,null,null,null,null,null,null,null,null,null,null,null,null,null,null,"PHASE 3  DISTANCES 1",null,null,null,null,null,null,null,null,null,null,null,null,null,null,null,null,null,null,null,"PHASE 4  DISTANCES 1",null,null,null,null,null,null,"PHASE 4  DISTANCES 1",null,null,null,null,null,null,null,null,null,"PHASE 5  DISTANCES 2",null,null,null,null,null,null,null,"PHASE 6  DISTANCES 2"]
[]
[null,"TOUR 1",null,null,null,null,null,null,"TOUR 2",null,null,null,null,null,null,null,"TOUR 3",null,null,null,null,null,null,"TOUR 4",null,null,null,null,null,null,null,null,null,"TOUR 5",null,null,null,null,null,null,"TOUR 6",null,null,null,null,null,null,null,null,null,null,"TOUR 7",null,null,null,null,null,null,null,null,"TOUR 8",null,null,null,null,null,null,"TOUR 9",null,null,null,null,null,null,null,null,null,"TOUR 10",null,null,null,null,null,null,null,"TOUR 11",null,null,null,null,null,null,null,"TOUR 12"]
[]
[]
[null,null,null,null,null,null,null,null,"J 16","ELIMINATOIRE 1",null,null,null,null,null,null,null,null,null,null,null,null,null,"J 9","ELIMINATOIRE 2",null,null,null,null,null,null,null,null,null,null,null,null,null,null,null,"J 8","ELIMINATOIRE 3",null,null,null,null,null,null,null,null,null,null,null,null,null,null,null,null,null,null,"J 3","ELIMINATOIRE 4",null,null,null,null,null,null,null,null,null,null,null,null,null,null,null,"1/4 DE FINALE"]
[null,null,null,null,null,null,null,null,"Match 5","JOUEUR","Pts","Rep","Ser",null,null,null,null,null,null,null,null,null,null,"Match 13","JOUEUR","Pts","Rep","Ser",null,null,null,null,null,null,null,null,null,null,null,null,"Match 21","JOUEUR","Pts","Rep","Ser",null,null,null,null,null,null,null,null,null,null,null,null,null,null,null,"Match 29","JOUEUR","Pts","Rep","Ser",null,null,null,null,null,null,null,null,null,null,null,null,"Match 37","JOUEUR","Pts","Rep","Ser",null,null,null,null,null,null,null,null,null,null,null,"PHASE 7  DISTANCES 2"]
[null,null,null,null,null,null,null,null,null,{"$f":"'Saisie des joueurs'!L33","v":""},null,null,null,{"$f":"IF(K12>K13,2,0)","v":0},null,null,null,null,null,null,null,null,null,null,{"$f":"'Saisie des joueurs'!L26","v":""},null,null,null,{"$f":"IF(Z12>Z13,2,0)","v":0},null,null,null,null,null,null,null,null,null,null,null,null,{"$f":"'Saisie des joueurs'!L25","v":""},null,null,null,{"$f":"IF(AQ12>AQ13,2,0)","v":0},null,null,null,null,null,null,null,null,null,null,null,null,null,null,null,{"$f":"'Saisie des joueurs'!L20","v":""},null,null,null,{"$f":"IF(BK12>BK13,2,0)","v":0},null,null,null,null,null,null,null,null,null,null,null,null,{"$f":"IF(BK12=BK13,\"\",IF(BK12>BK13,BJ12,BJ13))","v":""},null,null,null,{"$f":"IF(CB12>CB13,2,0)","v":0}]
[null,null,null,null,null,null,null,null,"Format Billard",{"$f":"IF(D16=D17,\"\",IF(D16>D17,C16,C17))","v":""},null,null,null,{"$f":"IF(K13>K12,2,0)","v":0},null,null,null,null,null,null,null,null,null,"Format Billard",{"$f":"IF(K12=K13,\"\",IF(K12>K13,J12,J13))","v":""},null,null,null,{"$f":"IF(Z13>Z12,2,0)","v":0},null,null,null,null,null,null,null,null,null,null,null,"Format Billard",{"$f":"IF(Z12=Z13,\"\",IF(Z12>Z13,Y12,Y13))","v":""},null,null,null,{"$f":"IF(AQ13>AQ12,2,0)","v":0},null,null,null,null,null,null,null,null,null,null,null,null,null,null,"Format Billard",{"$f":"IF(AQ12=AQ13,\"\",IF(AQ12>AQ13,AP12,AP13))","v":""},null,null,null,{"$f":"IF(BK13>BK12,2,0)","v":0},null,null,null,null,null,null,null,null,null,null,null,"Format Billard",{"$f":"IF(BR32=BR33,\"\",IF(BR32>BR33,BQ32,BQ33))","v":""},null,null,null,{"$f":"IF(CB13>CB12,2,0)","v":0}]
[null,"J 24","ELIMINATOIRE 1",null,null,null,null,null,null,null,{"$f":"IF(D16=D17,\"\",IF(D16<D17,C16,C17))","v":""},null,null,null,null,null,"ELIMINATOIRE 1",null,null,null,null,null,null,null,null,{"$f":"IF(S16=S17,\"\",IF(S16<S17,R16,R17))","v":""},null,null,null,null,null,null,null,"ELIMINATOIRE 2",null,null,null,null,null,null,null,null,{"$f":"IF(AJ16=AJ17,\"\",IF(AJ16<AJ17,AI16,AI17))","v":""},null,null,null,null,null,null,null,null,"ELIMINATOIRE 3",null,null,null,null,null,null,null,null,null,null,{"$f":"IF(BB16>BB17,BA16,BA17)","v":""},null,null,null,null,"REPÊCHAGE",null,null,null,null,null,null,null,null,null,null,null,{"$f":"IF(BR16=BR17,\"\",IF(BR16<BR17,BQ16,BQ17))","v":""},null,null,null,null,null,"1/2 FINALE",null,null,null,null,null,null,null,"3éme et 4éme PLACES"]
[null,"Match 1","JOUEUR","Pts","Rep","Ser",null,null,null,null,null,null,null,null,null,null,"Match 9","JOUEUR","Pts","Rep","Ser",null,null,null,null,null,null,null,null,null,null,null,null,"Match 17","JOUEUR","Pts","Rep","Ser",null,null,null,null,null,null,null,null,null,null,null,null,null,"Match 25","JOUEUR","Pts","Rep","Ser",null,null,null,null,null,null,null,null,null,null,null,"Match 33","JOUEUR","Pts","Rep","Ser",null,null,null,null,null,null,null,null,null,null,null,null,null,"Match 41","JOUEUR","Pts","Rep","Ser",null,null,null,"Match 43","JOUEUR","Pts","Rep","Ser"]
[null,null,{"$f":"'Saisie des joueurs'!L41","v":""},null,null,null,{"$f":"IF(D16>D17,2,0)","v":0},null,null,null,null,null,null,null,null,null,null,{"$f":"IF(D16=D17,\"\",IF(D16<D17,C16,C17))","v":""},null,null,null,{"$f":"IF(S16>S17,2,0)","v":0},null,null,null,null,null,null,null,null,null,null,null,null,{"$f":"IF(S16=S17,\"\",IF(S16>S17,R16,R17))","v":""},null,null,null,{"$f":"IF(AJ16>AJ17,2,0)","v":0},null,null,null,null,null,null,null,null,null,null,null,null,null,{"$f":"IF(AJ16=AJ17,\"\",IF(AJ16>AJ17,AI16,AI17))","v":""},null,null,null,{"$f":"IF(BB16>BB17,2,0)","v":0},null,null,null,null,null,null,null,null,null,null,null,{"$f":"IF(BB16=BB17,\"\",IF(BB16>BB17,BA16,BA17))","v":""},null,null,null,{"$f":"IF(BR16>BR17,2,0)","v":0},null,null,null,null,null,null,null,null,null,null,null,null,null,{"$f":"IF(CB12=CB13,\"\",IF(CB12>CB13,CA12,CA13))","v":""},null,null,null,{"$f":"IF(CJ16>CJ17,2,0)","v":0},null,null,null,{"$f":"IF(CJ16=CJ17,\"\",IF(CJ16<CJ17,CI16,CI17))","v":""},null,null,null,{"$f":"IF(CR16>CR17,2,0)","v":0}]
[null,"Format Billard",{"$f":"'Saisie des joueurs'!L34","v":""},null,null,null,{"$f":"IF(D17>D16,2,0)","v":0},null,null,null,null,null,null,null,null,null,"Format Billard",{"$f":"IF(K20=K21,\"\",IF(K20<K21,J20,J21))","v":""},null,null,null,{"$f":"IF(S17>S16,2,0)","v":0},null,null,null,null,null,null,null,null,null,null,null,"Format Billard",{"$f":"IF(Z36=Z37,\"\",IF(Z36<Z37,Y36,Y37))","v":""},null,null,null,{"$f":"IF(AJ17>AJ16,2,0)","v":0},null,null,null,null,null,null,null,null,null,null,null,null,"Format Billard",{"$f":"IF(AQ28=AQ29,\"\",IF(AQ28<AQ29,AP28,AP29))","v":""},null,null,null,{"$f":"IF(BB17>BB16,2,0)","v":0},null,null,null,null,null,null,null,null,null,null,"Format Billard",{"$f":"IF(BK12=BK13,\"\",IF(BK12<BK13,BJ12,BJ13))","v":""},null,null,null,{"$f":"IF(BR17>BR16,2,0)","v":0},null,null,null,null,null,null,null,null,null,null,null,null,"Format Billard",{"$f":"IF(CB20=CB21,\"\",IF(CB20>CB21,CA20,CA21))","v":""},null,null,null,{"$f":"IF(CJ17>CJ16,2,0)","v":0},null,null,"Format Billard",{"$f":"IF(CJ32=CJ33,\"\",IF(CJ32<CJ33,CI32,CI33))","v":""},null,null,null,{"$f":"IF(CR17>CR16,2,0)","v":0}]
[null,null,"J 17",{"$f":"J12","v":""},null,null,null,null,"J 15","ELIMINATOIRE 1",null,null,null,null,null,null,null,null,{"$f":"Y12","v":""},null,null,null,null,"J 10","ELIMINATOIRE 2",null,null,null,null,null,null,null,null,null,null,{"$f":"AP12","v":""},null,null,null,null,"J 7","ELIMINATOIRE 3",null,null,null,null,null,null,null,null,null,null,null,{"$f":"IF(AQ12=AQ13,\"\",IF(AQ12>AQ13,AP12,AP13))","v":""},null,null,null,null,null,null,"J 2","ELIMINATOIRE 4",null,null,null,null,null,null,null,{"$f":"IF(BK12=BK13,\"\",IF(BK12>BK13,BJ12,BJ13))","v":""},null,null,null,null,null,null,null,"1/4 DE FINALE",null,null,null,null,null,null,null,null,null,{"$f":"IF(CB12=CB13,\"\",IF(CB12<CB13,CA12,CA13))","v":""},null,null,null,null,null,null,null,{"$f":"IF(CB36=CB37,\"\",IF(CB36<CB37,CA36,CA37))","v":""}]
[null,"Format de Billard : mettre 3,10\nsi match joué sur ces billards",null,null,null,null,null,null,"Match 6","JOUEUR","Pts","Rep","Ser",null,null,null,null,null,null,null,null,null,null,"Match 14","JOUEUR","Pts","Rep","Ser",null,null,null,null,null,null,null,null,null,null,null,null,"Match 22","JOUEUR","Pts","Rep","Ser",null,null,null,null,null,null,null,null,null,null,null,null,null,null,null,"Match 30","JOUEUR","Pts","Rep","Ser",null,null,null,null,null,null,null,null,null,null,null,null,"Match 38","JOUEUR","Pts","Rep","Ser"]
[null,null,null,"Arbitre",null,null,null,null,null,{"$f":"'Saisie des joueurs'!L32","v":""},null,null,null,{"$f":"IF(K20>K21,2,0)","v":0},null,null,null,null,null,null,null,null,null,null,{"$f":"'Saisie des joueurs'!L27","v":""},null,null,null,{"$f":"IF(Z20>Z21,2,0)","v":0},null,null,null,null,null,null,null,null,null,null,null,null,{"$f":"'Saisie des joueurs'!L24","v":""},null,null,null,{"$f":"IF(AQ20>AQ21,2,0)","v":0},null,null,null,null,null,null,null,null,null,null,null,null,null,null,null,{"$f":"'Saisie des joueurs'!L19","v":""},null,null,null,{"$f":"IF(BK20>BK21,2,0)","v":0},null,null,null,null,null,null,null,null,null,null,null,null,{"$f":"IF(BK20=BK21,\"\",IF(BK20>BK21,BJ20,BJ21))","v":""},null,null,null,{"$f":"IF(CB20>CB21,2,0)","v":0}]
[null,null,null,null,null,null,null,null,"Format Billard",{"$f":"IF(D24=D25,\"\",IF(D24>D25,C24,C25))","v":""},null,null,null,{"$f":"IF(K21>K20,2,0)","v":0},null,null,null,null,null,null,null,null,null,"Format Billard",{"$f":"IF(K20=K21,\"\",IF(K20>K21,J20,J21))","v":""},null,null,null,{"$f":"IF(Z21>Z20,2,0)","v":0},null,null,null,null,null,null,null,null,null,null,null,"Format Billard",{"$f":"IF(Z20=Z21,\"\",IF(Z20>Z21,Y20,Y21))","v":""},null,null,null,{"$f":"IF(AQ21>AQ20,2,0)","v":0},null,null,null,null,null,null,null,null,null,null,null,null,null,null,"Format Billard",{"$f":"IF(AQ20=AQ21,\"\",IF(AQ20>AQ21,AP20,AP21))","v":""},null,null,null,{"$f":"IF(BK21>BK20,2,0)","v":0},null,null,null,null,null,null,null,null,null,null,null,"Format Billard",{"$f":"IF(BR40=BR41,\"\",IF(BR40>BR41,BQ40,BQ41))","v":""},null,null,null,{"$f":"IF(CB21>CB20,2,0)","v":0}]
[null,"J 23","ELIMINATOIRE 1",null,null,null,null,null,null,null,{"$f":"IF(D24=D25,\"\",IF(D24<D25,C24,C25))","v":""},null,null,null,null,null,"ELIMINATOIRE 1",null,null,null,null,null,null,null,null,{"$f":"IF(S24=S25,\"\",IF(S24<S25,R24,R25))","v":""},null,null,null,null,null,null,null,"ELIMINATOIRE 2",null,null,null,null,null,null,null,null,{"$f":"IF(AJ24=AJ25,\"\",IF(AJ24<AJ25,AI24,AI25))","v":""},null,null,null,null,null,null,null,null,"ELIMINATOIRE 3",null,null,null,null,null,null,null,null,null,null,{"$f":"IF(BB24>BB25,BA24,BA25)","v":""},null,null,null,null,"REPÊCHAGE",null,null,null,null,null,null,null,null,null,null,null,{"$f":"IF(BR24=BR25,\"\",IF(BR24<BR25,BQ24,BQ25))","v":""}]
[null,"Match 2","JOUEUR","Pts","Rep","Ser",null,null,null,null,null,null,null,null,null,null,"Match 10","JOUEUR","Pts","Rep","Ser",null,null,null,null,null,null,null,null,null,null,null,null,"Match 18","JOUEUR","Pts","Rep","Ser",null,null,null,null,null,null,null,null,null,null,null,null,null,"Match 26","JOUEUR","Pts","Rep","Ser",null,null,null,null,null,null,null,null,null,null,null,"Match 34","JOUEUR","Pts","Rep","Ser"]
[null,null,{"$f":"'Saisie des joueurs'!L40","v":""},null,null,null,{"$f":"IF(D24>D25,2,0)","v":0},null,null,null,null,null,null,null,null,null,null,{"$f":"IF(D24=D25,\"\",IF(D24<D25,C24,C25))","v":""},null,null,null,{"$f":"IF(S24>S25,2,0)","v":0},null,null,null,null,null,null,null,null,null,null,null,null,{"$f":"IF(S24=S25,\"\",IF(S24>S25,R24,R25))","v":""},null,null,null,{"$f":"IF(AJ24>AJ25,2,0)","v":0},null,null,null,null,null,null,null,null,null,null,null,null,null,{"$f":"IF(AJ24=AJ25,\"\",IF(AJ24>AJ25,AI24,AI25))","v":""},null,null,null,{"$f":"IF(BB24>BB25,2,0)","v":0},null,null,null,null,null,null,null,null,null,null,null,{"$f":"IF(BB24=BB25,\"\",IF(BB24>BB25,BA24,BA25))","v":""},null,null,null,{"$f":"IF(BR24>BR25,2,0)","v":0}]
[null,"Format Billard",{"$f":"'Saisie des joueurs'!L35","v":""},null,null,null,{"$f":"IF(D25>D24,2,0)","v":0},null,null,null,null,null,null,null,null,null,"Format Billard",{"$f":"IF(K12=K13,\"\",IF(K12<K13,J12,J13))","v":""},null,null,null,{"$f":"IF(S25>S24,2,0)","v":0},null,null,null,null,null,null,null,null,null,null,null,"Format Billard",{"$f":"IF(Z28=Z29,\"\",IF(Z28<Z29,Y28,Y29))","v":""},null,null,null,{"$f":"IF(AJ25>AJ24,2,0)","v":0},null,null,null,null,null,null,null,null,null,null,null,null,"Format Billard",{"$f":"IF(AQ36=AQ37,\"\",IF(AQ36<AQ37,AP36,AP37))","v":""},null,null,null,{"$f":"IF(BB25>BB24,2,0)","v":0},null,null,null,null,null,null,null,null,null,null,"Format Billard",{"$f":"IF(BK20=BK21,\"\",IF(BK20<BK21,BJ20,BJ21))","v":""},null,null,null,{"$f":"IF(BR25>BR24,2,0)","v":0}]
[null,null,"J 18",{"$f":"J20","v":""},null,null,null,null,"J 14","ELIMINATOIRE 1",null,null,null,null,null,null,null,null,{"$f":"Y20","v":""},null,null,null,null,"J 11","ELIMINATOIRE 2",null,null,null,null,null,null,null,null,null,null,{"$f":"AP20","v":""},null,null,null,null,"J6","ELIMINATOIRE 3",null,null,null,null,null,null,null,null,null,null,null,{"$f":"IF(AQ20=AQ21,\"\",IF(AQ20>AQ21,AP20,AP21))","v":""},null,null,null,null,null,null,"J 1","ELIMINATOIRE 4",null,null,null,null,null,null,null,{"$f":"IF(BK20=BK21,\"\",IF(BK20>BK21,BJ20,BJ21))","v":""},null,null,null,null,null,null,null,"1/4 DE FINALE"]
[null,null,null,null,null,null,null,null,"Match 7","JOUEUR","Pts","Rep","Ser",null,null,null,null,null,null,null,null,null,null,"Match 15","JOUEUR","Pts","Rep","Ser",null,null,null,null,null,null,null,null,null,null,null,null,"Match 23","JOUEUR","Pts","Rep","Ser",null,null,null,null,null,null,null,null,null,null,null,null,null,null,null,"Match 31","JOUEUR","Pts","Rep","Ser",null,null,null,null,null,null,null,null,null,null,null,null,"Match 39","JOUEUR","Pts","Rep","Ser",null,null,null,null,null,null,null,null,null,null,null,"PHASE 8  DISTANCES 2"]
[null,null,null,null,null,null,null,null,null,{"$f":"'Saisie des joueurs'!L31","v":""},null,null,null,{"$f":"IF(K28>K29,2,0)","v":0},null,null,null,null,null,null,null,null,null,null,{"$f":"'Saisie des joueurs'!L28","v":""},null,null,null,{"$f":"IF(Z28>Z29,2,0)","v":0},null,null,null,null,null,null,null,null,null,null,null,null,{"$f":"'Saisie des joueurs'!L23","v":""},null,null,null,{"$f":"IF(AQ28>AQ29,2,0)","v":0},null,null,null,null,null,null,null,null,null,null,null,null,null,null,null,{"$f":"'Saisie des joueurs'!L18","v":""},null,null,null,{"$f":"IF(BK28>BK29,2,0)","v":0},null,null,null,null,null,null,null,null,null,null,null,null,{"$f":"IF(BK28=BK29,\"\",IF(BK28>BK29,BJ28,BJ29))","v":""},null,null,null,{"$f":"IF(CB28>CB29,2,0)","v":0}]
[null,null,null,null,null,null,null,null,"Format Billard",{"$f":"IF(D32=D33,\"\",IF(D32>D33,C32,C33))","v":""},null,null,null,{"$f":"IF(K29>K28,2,0)","v":0},null,null,null,null,null,null,null,null,null,"Format Billard",{"$f":"IF(K28=K29,\"\",IF(K28>K29,J28,J29))","v":""},null,null,null,{"$f":"IF(Z29>Z28,2,0)","v":0},null,null,null,null,null,null,null,null,null,null,null,"Format Billard",{"$f":"IF(Z28=Z29,\"\",IF(Z28>Z29,Y28,Y29))","v":""},null,null,null,{"$f":"IF(AQ29>AQ28,2,0)","v":0},null,null,null,null,null,null,null,null,null,null,null,null,null,null,"Format Billard",{"$f":"IF(AQ28=AQ29,\"\",IF(AQ28>AQ29,AP28,AP29))","v":""},null,null,null,{"$f":"IF(BK29>BK28,2,0)","v":0},null,null,null,null,null,null,null,null,null,null,null,"Format Billard",{"$f":"IF(BR16=BR17,\"\",IF(BR16>BR17,BQ16,BQ17))","v":""},null,null,null,{"$f":"IF(CB29>CB28,2,0)","v":0}]
[null,"J 22","ELIMINATOIRE 1",null,null,null,null,null,null,null,{"$f":"IF(D32=D33,\"\",IF(D32<D33,C32,C33))","v":""},null,null,null,null,null,"ELIMINATOIRE 1",null,null,null,null,null,null,null,null,{"$f":"IF(S32=S33,\"\",IF(S32<S33,R32,R33))","v":""},null,null,null,null,null,null,null,"ELIMINATOIRE 2",null,null,null,null,null,null,null,null,{"$f":"IF(AJ32=AJ33,\"\",IF(AJ32<AJ33,AI32,AI33))","v":""},null,null,null,null,null,null,null,null,"ELIMINATOIRE 3",null,null,null,null,null,null,null,null,null,null,{"$f":"IF(BB32>BB33,BA32,BA33)","v":""},null,null,null,null,"REPÊCHAGE",null,null,null,null,null,null,null,null,null,null,null,{"$f":"IF(BR32=BR33,\"\",IF(BR32<BR33,BQ32,BQ33))","v":""},null,null,null,null,null,"1/2 FINALE",null,null,null,null,null,null,null,"FINALE"]
[null,"Match 3","JOUEUR","Pts","Rep","Ser",null,null,null,null,null,null,null,null,null,null,"Match 11","JOUEUR","Pts","Rep","Ser",null,null,null,null,null,null,null,null,null,null,null,null,"Match 19","JOUEUR","Pts","Rep","Ser",null,null,null,null,null,null,null,null,null,null,null,null,null,"Match 27","JOUEUR","Pts","Rep","Ser",null,null,null,null,null,null,null,null,null,null,null,"Match 35","JOUEUR","Pts","Rep","Ser",null,null,null,null,null,null,null,null,null,null,null,null,null,"Match 42","JOUEUR","Pts","Rep","Ser",null,null,null,"Match 44","JOUEUR","Pts","Rep","Ser"]
[null,null,{"$f":"'Saisie des joueurs'!L39","v":""},null,null,null,{"$f":"IF(D32>D33,2,0)","v":0},null,null,null,null,null,null,null,null,null,null,{"$f":"IF(D32=D33,\"\",IF(D32<D33,C32,C33))","v":""},null,null,null,{"$f":"IF(S32>S33,2,0)","v":0},null,null,null,null,null,null,null,null,null,null,null,null,{"$f":"IF(S32=S33,\"\",IF(S32>S33,R32,R33))","v":""},null,null,null,{"$f":"IF(AJ32>AJ33,2,0)","v":0},null,null,null,null,null,null,null,null,null,null,null,null,null,{"$f":"IF(AJ32=AJ33,\"\",IF(AJ32>AJ33,AI32,AI33))","v":""},null,null,null,{"$f":"IF(BB32>BB33,2,0)","v":0},null,null,null,null,null,null,null,null,null,null,null,{"$f":"IF(BB32=BB33,\"\",IF(BB32>BB33,BA32,BA33))","v":""},null,null,null,{"$f":"IF(BR32>BR33,2,0)","v":0},null,null,null,null,null,null,null,null,null,null,null,null,null,{"$f":"IF(CB28=CB29,\"\",IF(CB28>CB29,CA28,CA29))","v":""},null,null,null,{"$f":"IF(CJ32>CJ33,2,0)","v":0},null,null,null,{"$f":"IF(CJ16=CJ17,\"\",IF(CJ16>CJ17,CI16,CI17))","v":""},null,null,null,{"$f":"IF(CR32>CR33,2,0)","v":0}]
[null,"Format Billard",{"$f":"'Saisie des joueurs'!L36","v":""},null,null,null,{"$f":"IF(D33>D32,2,0)","v":0},null,null,null,null,null,null,null,null,null,"Format Billard",{"$f":"IF(K36=K37,\"\",IF(K36<K37,J36,J37))","v":""},null,null,null,{"$f":"IF(S33>S32,2,0)","v":0},null,null,null,null,null,null,null,null,null,null,null,"Format Billard",{"$f":"IF(Z20=Z21,\"\",IF(Z20<Z21,Y20,Y21))","v":""},null,null,null,{"$f":"IF(AJ33>AJ32,2,0)","v":0},null,null,null,null,null,null,null,null,null,null,null,null,"Format Billard",{"$f":"IF(AQ12=AQ13,\"\",IF(AQ12<AQ13,AP12,AP13))","v":""},null,null,null,{"$f":"IF(BB33>BB32,2,0)","v":0},null,null,null,null,null,null,null,null,null,null,"Format Billard",{"$f":"IF(BK28=BK29,\"\",IF(BK28<BK29,BJ28,BJ29))","v":""},null,null,null,{"$f":"IF(BR33>BR32,2,0)","v":0},null,null,null,null,null,null,null,null,null,null,null,null,"Format Billard",{"$f":"IF(CB36=CB37,\"\",IF(CB36>CB37,CA36,CA37))","v":""},null,null,null,{"$f":"IF(CJ33>CJ32,2,0)","v":0},null,null,"Format Billard",{"$f":"IF(CJ32=CJ33,\"\",IF(CJ32>CJ33,CI32,CI33))","v":""},null,null,null,{"$f":"IF(CR33>CR32,2,0)","v":0}]
[null,null,"J 19",{"$f":"J28","v":""},null,null,null,null,"J 13","ELIMINATOIRE 1",null,null,null,null,null,null,null,null,{"$f":"Y28","v":""},null,null,null,null,"J 12","ELIMINATOIRE 2",null,null,null,null,null,null,null,null,null,null,{"$f":"AP28","v":""},null,null,null,null,"J5","ELIMINATOIRE 3",null,null,null,null,null,null,null,null,null,null,null,{"$f":"IF(AQ28=AQ29,\"\",IF(AQ28>AQ29,AP28,AP29))","v":""},null,null,null,null,null,null,"J 4","ELIMINATOIRE 4",null,null,null,null,null,null,null,{"$f":"IF(BK28=BK29,\"\",IF(BK28>BK29,BJ28,BJ29))","v":""},null,null,null,null,null,null,null,"1/4 DE FINALE",null,null,null,null,null,null,null,null,null,{"$f":"IF(CB28=CB29,\"\",IF(CB28<CB29,CA28,CA29))","v":""},null,null,null,null,null,null,null,{"$f":"IF(CB20=CB21,\"\",IF(CB20<CB21,CA20,CA21))","v":""}]
[null,null,null,null,null,null,null,null,"Match 8","JOUEUR","Pts","Rep","Ser",null,null,null,null,null,null,null,null,null,null,"Match 16","JOUEUR","Pts","Rep","Ser",null,null,null,null,null,null,null,null,null,null,null,null,"Match 25","JOUEUR","Pts","Rep","Ser",null,null,null,null,null,null,null,null,null,null,null,null,null,null,null,"Match 32","JOUEUR","Pts","Rep","Ser",null,null,null,null,null,null,null,null,null,null,null,null,"Match 40","JOUEUR","Pts","Rep","Ser"]
[null,null,null,null,null,null,null,null,null,{"$f":"'Saisie des joueurs'!L30","v":""},null,null,null,{"$f":"IF(K36>K37,2,0)","v":0},null,null,null,null,null,null,null,null,null,null,{"$f":"'Saisie des joueurs'!L29","v":""},null,null,null,{"$f":"IF(Z36>Z37,2,0)","v":0},null,null,null,null,null,null,null,null,null,null,null,null,{"$f":"'Saisie des joueurs'!L22","v":""},null,null,null,{"$f":"IF(AQ36>AQ37,2,0)","v":0},null,null,null,null,null,null,null,null,null,null,null,null,null,null,null,{"$f":"'Saisie des joueurs'!L21","v":""},null,null,null,{"$f":"IF(BK36>BK37,2,0)","v":0},null,null,null,null,null,null,null,null,null,null,null,null,{"$f":"IF(BK36=BK37,\"\",IF(BK36>BK37,BJ36,BJ37))","v":""},null,null,null,{"$f":"IF(CB36>CB37,2,0)","v":0}]
[null,null,null,null,null,null,null,null,"Format Billard",{"$f":"IF(D40=D41,\"\",IF(D40>D41,C40,C41))","v":""},null,null,null,{"$f":"IF(K37>K36,2,0)","v":0},null,null,null,null,null,null,null,null,null,"Format Billard",{"$f":"IF(K36=K37,\"\",IF(K36>K37,J36,J37))","v":""},null,null,null,{"$f":"IF(Z37>Z36,2,0)","v":0},null,null,null,null,null,null,null,null,null,null,null,"Format Billard",{"$f":"IF(Z36=Z37,\"\",IF(Z36>Z37,Y36,Y37))","v":""},null,null,null,{"$f":"IF(AQ37>AQ36,2,0)","v":0},null,null,null,null,null,null,null,null,null,null,null,null,null,null,"Format Billard",{"$f":"IF(AQ36=AQ37,\"\",IF(AQ36>AQ37,AP36,AP37))","v":""},null,null,null,{"$f":"IF(BK37>BK36,2,0)","v":0},null,null,null,null,null,null,null,null,null,null,null,"Format Billard",{"$f":"IF(BR24=BR25,\"\",IF(BR24>BR25,BQ24,BQ25))","v":""},null,null,null,{"$f":"IF(CB37>CB36,2,0)","v":0}]
[null,"J 21","ELIMINATOIRE 1",null,null,null,null,null,null,null,{"$f":"IF(D40=D41,\"\",IF(D40<D41,C40,C41))","v":""},null,null,null,null,null,"ELIMINATOIRE 1",null,null,null,null,null,null,null,null,{"$f":"IF(S40=S41,\"\",IF(S40<S41,R40,R41))","v":""},null,null,null,null,null,null,null,"ELIMINATOIRE 2",null,null,null,null,null,null,null,null,{"$f":"IF(AJ40=AJ41,\"\",IF(AJ40<AJ41,AI40,AI41))","v":""},null,null,null,null,null,null,null,null,"ELIMINATOIRE 3",null,null,null,null,null,null,null,null,null,null,{"$f":"IF(BB40>BB41,BA40,BA41)","v":""},null,null,null,null,"REPÊCHAGE",null,null,null,null,null,null,null,null,null,null,null,{"$f":"IF(BR40=BR41,\"\",IF(BR40<BR41,BQ40,BQ41))","v":""}]
[null,"Match 4","JOUEUR","Pts","Rep","Ser",null,null,null,null,null,null,null,null,null,null,"Match 12","JOUEUR","Pts","Rep","Ser",null,null,null,null,null,null,null,null,null,null,null,null,"Match 20","JOUEUR","Pts","Rep","Ser",null,null,null,null,null,null,null,null,null,null,null,null,null,"Match 28","JOUEUR","Pts","Rep","Ser",null,null,null,null,null,null,null,null,null,null,null,"Match 36","JOUEUR","Pts","Rep","Ser"]
[null,null,{"$f":"'Saisie des joueurs'!L38","v":""},null,null,null,{"$f":"IF(D40>D41,2,0)","v":0},null,null,null,null,null,null,null,null,null,null,{"$f":"IF(D40=D41,\"\",IF(D40<D41,C40,C41))","v":""},null,null,null,{"$f":"IF(S40>S41,2,0)","v":0},null,null,null,null,null,null,null,null,null,null,null,null,{"$f":"IF(S40=S41,\"\",IF(S40>S41,R40,R41))","v":""},null,null,null,{"$f":"IF(AJ40>AJ41,2,0)","v":0},null,null,null,null,null,null,null,null,null,null,null,null,null,{"$f":"IF(AJ40=AJ41,\"\",IF(AJ40>AJ41,AI40,AI41))","v":""},null,null,null,{"$f":"IF(BB40>BB41,2,0)","v":0},null,null,null,null,null,null,null,null,null,null,null,{"$f":"IF(BB40=BB41,\"\",IF(BB40>BB41,BA40,BA41))","v":""},null,null,null,{"$f":"IF(BR40>BR41,2,0)","v":0}]
[null,"Format Billard",{"$f":"'Saisie des joueurs'!L37","v":""},null,null,null,{"$f":"IF(D41>D40,2,0)","v":0},null,null,null,null,null,null,null,null,null,"Format Billard",{"$f":"IF(K28=K29,\"\",IF(K28<K29,J28,J29))","v":""},null,null,null,{"$f":"IF(S41>S40,2,0)","v":0},null,null,null,null,null,null,null,null,null,null,null,"Format Billard",{"$f":"IF(Z12=Z13,\"\",IF(Z12<Z13,Y12,Y13))","v":""},null,null,null,{"$f":"IF(AJ41>AJ40,2,0)","v":0},null,null,null,null,null,null,null,null,null,null,null,null,"Format Billard",{"$f":"IF(AQ20=AQ21,\"\",IF(AQ20<AQ21,AP20,AP21))","v":""},null,null,null,{"$f":"IF(BB41>BB40,2,0)","v":0},null,null,null,null,null,null,null,null,null,null,"Format Billard",{"$f":"IF(BK36=BK37,\"\",IF(BK36<BK37,BJ36,BJ37))","v":""},null,null,null,{"$f":"IF(BR41>BR40,2,0)","v":0}]
[null,null,"J 20",{"$f":"J36","v":""},null,null,null,null,null,null,null,null,null,null,null,null,null,null,{"$f":"Y36","v":""},null,null,null,null,null,null,null,null,null,null,null,null,null,null,null,null,{"$f":"AP36","v":""},null,null,null,null,null,null,null,null,null,null,null,null,null,null,null,null,null,{"$f":"IF(AQ36=AQ37,\"\",IF(AQ36>AQ37,AP36,AP37))","v":""},null,null,null,null,null,null,null,null,null,null,null,null,null,null,null,{"$f":"IF(BK36=BK37,\"\",IF(BK36>BK37,BJ36,BJ37))","v":""}]
[null,null,null,null,null,null,null,null,null,"24 joueurs sur 4 billards"]
[null,{"$f":"'Saisie des joueurs'!D11:D11","v":0},null,null,{"$f":"'Saisie des joueurs'!$D$7","v":"T1"},{"$f":"'Saisie des joueurs'!$D$9","v":"3 BANDES"},null,null,null,{"$f":"'Saisie des joueurs'!G11","v":0},{"$f":"'Saisie des joueurs'!D5","v":"00:00:00"},null,null,null,null,null,"Dans ces matchs, il n'y a pas d'égalité de scores entre les joueurs.\n Appliquer la règle des prolongations définie dans le Règlement Sportif Art.4-03… Dans les points saisis sur cette feuille, mettre 1 point de plus sur le score du joueur remportant les prolongations pour les départager.\n\nPar contre sur la saisie FFB, mettre le même nombre de points aux deux joueurs, mais mettre 2 points gagnants au 1er et 0 point au 2ème et forcer ce choix.",null,null,null,null,null,null,null,null,null,"Si égalité de points : prolongations.\nIL NE PEUT Y AVOIR DE MATCH NUL.",null,null,null,null,null,null,null,null,null,null,null,null,null,"Rappel : Format de Billard : mettre 3,10\nsi match joué sur ces billards"]
[null,null,null,null,null,null,null,null,null,null,null,null,null,null,null,null,null,null,null,null,null,null,null,null,null,null,null,null,null,null,null,null,null,null,null,null,null,null,null,null,null,null,null,null,null,null,null,null,null,null,null,null,null,null,null,null,null,null,null,null,null,null,null,null,null,null,null,null,null,null,null,null,null,null,null,null,null,"Rappel : Format de Billard : mettre 3,10\nsi match joué sur ces billards"]
[null,null,"™A.FERHAT ™ C.PEREZ",null,null,null,null,null,null,null,null,null,null,null,null,null,null,null,null,null,null,null,null,null,null,null,"Distance non limitée au 3B."]
[null,null,null,null,null,null,null,null,null,null,null,null,null,null,null,null,null,null,null,null,null,null,null,null,null,null,"Joueur A débute, une seule reprise sur point de départ."]
[null,"SI JOUEUR EST \"ABSENT\", METTRE 1 POINT AU JOUEUR QUI EST SUR LE BILLARD POUR FAIRE AVANCER LE GRAPHIQUE.\n NE PAS SAISIR CES MATCHS NON JOUES.",null,null,null,null,null,null,null,null,null,null,null,null,null,null,null,null,null,null,null,null,null,null,null,null,"Joueur B débute, une seule reprise sur point de départ."]
[null,null,null,null,null,null,null,null,null,null,null,null,null,null,null,null,null,null,null,null,null,null,null,null,null,null,"Si égalité nouvelle prolongation selon le même principe..."]
[null,null,null,null,null,null,null,null,null,null,null,null,null,null,null,null,null,null,null,null,null,null,null,null,null,null,"Jusqu'à élimination d'un joueur."]

{"sheet":"Distances","index":6,"n_rows":24,"n_cols":7,"rows_kept":24,"cut":false,"hidden":false,"merged":[[4,1,10,3],[12,1,18,3],[23,1,23,2],[0,1,0,5],[1,1,1,5],[2,1,2,5]]}
[null,"ANNEXE 1 au RS Carambole 2023-2024"]
[null,"LIGUE MEDITERANNEE BILLARD"]
[null,"Catégories et Distances"]
[]
[null,"DISTANCES 1\n3 BANDES 2KO\nPhases jusqu'aux\nrepêchages",null,null,"N 1","30 Pts / 50 r"]
[null,null,null,null,"N 2","25 Pts / 50 r"]
[]
[null,null,null,null,null,"2,80 m","3,10 m"]
[null,null,null,null,"N 3","15 Pts / 40 r","12 Pts / 40 r"]
[null,null,null,null,"R 1","12 Pts / 40 r","10 Pts / 40 r"]
[null,null,null,null,"R 2","8 Pts / 40 r"]
[]
[null,"DISTANCES 2\n3 BANDES 2KO\nPhases finales",null,null,"N 1","35 Pts / 50 r"]
[null,null,null,null,"N 2","30 Pts / 50 r"]
[]
[null,null,null,null,null,"2,80 m","3,10 m"]
[null,null,null,null,"N 3","20 Pts / 40 r","15 Pts / 40 r"]
[null,null,null,null,"R 1","15 Pts / 40 r","13 Pts / 40 r"]
[null,null,null,null,"R 2","11 Pts / 40 r"]
[]
[]
[]
[]
[null,"™A.FERHAT ™ C.PEREZ"]

{"sheet":"Heures convocations","index":7,"n_rows":40,"n_cols":9,"rows_kept":40,"cut":false,"hidden":false,"merged":[[31,2,32,2],[5,3,5,5],[0,0,0,6],[3,0,3,4],[7,0,7,6],[10,3,10,6],[11,1,12,1],[11,2,12,2],[26,2,27,2],[11,0,25,0],[26,0,36,0],[26,1,27,1]]}
["LIGUE MEDITERRANEENNE DE BILLARD"]
[]
[]
["TOURNOI HOMOLOGUE",null,null,null,null,{"$f":"'Saisie des joueurs'!D7","v":"T1"},{"$f":"'Saisie des joueurs'!D9","v":"3 BANDES"}]
[]
[null,null,null,{"$f":"'Saisie des joueurs'!D11:D11","v":0},null,null,{"$f":"'Saisie des joueurs'!D5","v":"00:00:00"},null," "]
[]
["HORAIRES DES CONVOCATIONS JOUEURS ET ARBITRES"]
[]
[]
["JOUR","N° TOUR HORAIRE ","HEURE CONVOC","NOMS"]
["SAMEDI",1,"8 H 30",{"$f":"'GRAPHIQUE 24J'!C16","v":""},{"$f":"'GRAPHIQUE 24J'!C24","v":""},{"$f":"'GRAPHIQUE 24J'!C32","v":""},{"$f":"'GRAPHIQUE 24J'!C40","v":""}]
[null,null,null,{"$f":"'GRAPHIQUE 24J'!C17","v":""},{"$f":"'GRAPHIQUE 24J'!C25","v":""},{"$f":"'GRAPHIQUE 24J'!C33","v":""},{"$f":"'GRAPHIQUE 24J'!C41","v":""}]
[null,"09 H 00","8 H 45",{"$f":"'GRAPHIQUE 24J'!J12","v":""},{"$f":"'GRAPHIQUE 24J'!J20","v":""},{"$f":"'GRAPHIQUE 24J'!J28","v":""},{"$f":"'GRAPHIQUE 24J'!J36","v":""}]
[null,2]
[null,"10 H 15"]
[null,3,"11 H 15",{"$f":"'GRAPHIQUE 24J'!Y12","v":""},{"$f":"'GRAPHIQUE 24J'!Y20","v":""},{"$f":"'GRAPHIQUE 24J'!Y28","v":""},{"$f":"'GRAPHIQUE 24J'!Y36","v":""}]
[null,"11 H 30"]
[null,4]
[null,"13 H 00"]
[null,5,"14 H 15",{"$f":"'GRAPHIQUE 24J'!AP12","v":""},{"$f":"'GRAPHIQUE 24J'!AP20","v":""},{"$f":"'GRAPHIQUE 24J'!AP28","v":""},{"$f":"'GRAPHIQUE 24J'!AP36","v":""}]
[null,"14 H 30"]
[null,6]
[null,"16 H 00"]
[null,7]
[null,"17 H 30"]
["DIMANCHE",8,"8 H 30",{"$f":"'GRAPHIQUE 24J'!BJ12","v":""},{"$f":"'GRAPHIQUE 24J'!BJ20","v":""},{"$f":"'GRAPHIQUE 24J'!BJ28","v":""},{"$f":"'GRAPHIQUE 24J'!BJ36","v":""}]
[null,null,null,"GAGNANT MATCH 21","GAGNANT MATCH 22","GAGNANT MATCH 23","GAGNANT MATCH 24"]
[null,"09 H 00","8 H 45","GAGNANT MATCH 25","GAGNANT MATCH 26","GAGNANT MATCH 27","GAGNANT MATCH 28"]
[null,9]
[]
[null,10]
[]
[null,11]
[]
[null,12]
[]
[]
[]
[null,null,"™A.FERHAT ™ C.PEREZ"]