{"text_format":"1","workbook":"xlsx","n_sheets":8,"sheets":["BOISSON","CLUB","DONNEES","FICHE-JOUEUR","Saisie des joueurs","GRAPHIQUE 24J","Distances","Heures convocations"],"not_rendered":{"charts":0,"images":3,"macros":1,"external_links":0,"defined_names":6,"comments":1,"pivot_tables":0},"unopened":[],"bounds":{"document_bytes":16777216,"sheet_cells":100000,"rows_first":2000,"rows_last":500,"rows_between":2000,"halvings":0,"cell_chars":16384,"cell_head_chars":4096},"cells_cut":0,"cells_raw":0,"read":"whole","date_system":"1900"}

{"sheet":"BOISSON","index":0,"n_rows":26,"n_cols":7,"rows_kept":26,"cut":false,"hidden":false,"merged":[[0,1,0,6]]}
[null,"BILLARD CLUB"]
["N°","Nom - Prénom","EAU","BOISSONS","REPAS","TOTAL","CLUB"]
[{"$f":"ROW(A1)","v":1},{"$f":"'Saisie des joueurs'!B18","v":0}]
[{"$f":"ROW(A2)","v":2},{"$f":"'Saisie des joueurs'!B19","v":0}]
[3,{"$f":"'Saisie des joueurs'!B20","v":0}]
[4,{"$f":"'Saisie des joueurs'!B21","v":0}]
[5,{"$f":"'Saisie des joueurs'!B22","v":0}]
[6,{"$f":"'Saisie des joueurs'!B23","v":0}]
[7,{"$f":"'Saisie des joueurs'!B24","v":0}]
[8,{"$f":"'Saisie des joueurs'!B25","v":0}]
[9,{"$f":"'Saisie des joueurs'!B26","v":0}]
[10,{"$f":"'Saisie des joueurs'!B27","v":0}]
[11,{"$f":"'Saisie des joueurs'!B28","v":0}]
[12,{"$f":"'Saisie des joueurs'!B29","v":0}]
[13,{"$f":"'Saisie des joueurs'!B30","v":0}]
[14,{"$f":"'Saisie des joueurs'!B31","v":0}]
[15,{"$f":"'Saisie des joueurs'!B32","v":0}]
[16,{"$f":"'Saisie des joueurs'!B33","v":0}]
[17,{"$f":"'Saisie des joueurs'!B34","v":0}]
[18,{"$f":"'Saisie des joueurs'!B35","v":0}]
{"$rows_left_out":7}
{"sheet":"CLUB","index":1,"n_rows":27,"n_cols":5,"rows_kept":27,"cut":false,"hidden":true,"merged":[[0,0,0,4]]}
["CLUB AFFILIE LMB\n"]
["CLUB","ADRESSE 1","ADRESSE 2","CODE POSTAL","VILLE"]
["BILLARD CLUB DE ST RAPHAEL","90 RUE THOMAS EDISON","LA PALUD",83600,"FREJUS"]
["ACADEMIE DE BILLARD DE BOLLENE","GROUPE SCOLAIRE PIERRE MARIE CURIE",null,84500,"BOLLENE"]
["ACADEMIE DE BILLARD DE MENTON","Académie municipale de billard","Allée du Louvre Salon du Louvre",6500,"MENTON"]
["BILLARD CLUB  AIX EN PROVENCE","RUE PIERRE DE COUBERTIN",null,13100,"AIX EN PROVENCE"]
["BILLARD CLUB AMATEUR ROGNAC","60 BOULEVARD JEAN JAURES",null,13340,"ROGNAC"]
["BILLARD CLUB AVIGNONNAIS","12 RUE BONAPARTE","MAISON DU COMBATTANT",84000,"AVIGNON"]
["BILLARD CLUB BERROIS","RUE MARCEL PAGNOL",null,13130,"BERRE L ETANG"]
["BILLARD CLUB CARPENTRASSIEN","264 BOULEVARD ALBIN DURAND",null,84200,"CARPENTRAS"]
["BILLARD CLUB CAVAILLONNAIS","CERCLE DE L INDEPENDANCE","97 COURS VICTOR HUGO",84300,"CAVAILLON"]
["BILLARD CLUB CLUB ARLESIEN","1 RUE HONORE CLAIR",null,13200,"ARLES"]
["BILLARD CLUB DE LA BAIE CAVALAIRE","SALLE OTTAVI","AVENUE DES ALLIES",83240,"CAVALAIRE SUR MER"]
["ACADEMIE DE BILLARD DE BARBOSSI","COUNTRY CLIB DE BARBOSSI","23 CHEMIN DE MAURE-VIEL",6210,"MANDELIEU"]
["BILLARD CLUB DE NICE","SALLE MALATESTA","64 AVENUE CYRILLE BESSET",6100,"NICE"]
["BILLARD CLUB LA FARE LES OLIVIERS","36 BIS AVENUE PASTEUR",null,13580,"LA FARE LES OLIVIERS"]
["BILLARD CLUB LA GARDE","LE MAS QUARTIER SAINTE MARGUERITE","293 AVENUE PIERRE LOTI",83130,"LA GARDE"]
["BILLARD CLUB ORANGE","ACADEMIE DE BILLARD","67 COURS POURTOULES",84100,"ORANGE"]
["BILLARD CLUB ORANGE","MAISON DES ASSOCIATIONS","ROUTE DE CADEROUSSE",84100,"ORANGE"]
["BILLARD CLUB PHOCEEN","12 rue du docteur ACQUAVIVA",null,13004,"MARSEILLE"]
{"$rows_left_out":8}
{"sheet":"DONNEES","index":2,"n_rows":386,"n_cols":6,"rows_kept":386,"cut":false,"hidden":false,"merged":[[0,0,0,5]]}
["Classification  L.M.B   3 BANDES\n 2023 - 2024"]
[]
["NC","NOM","LICENCE","CAT","MG","CLUB"]
[null,"ABAD YANNICK","106287Z","N2",0.46899999999999997,"19002--SPORT AMAT.DE BILLARD MARSEILLAIS"]
[null,"ABEAUZIT JACQUES","106902Q","N3",0.373,"19014--BILLARD CLUB AVIGNONNAIS"]
[null,"ABSENT",0,"XX",0,"XXXXXXXX"]
[null,"AKNIN GABRIEL","021810W","N2",0.47899999999999998,"19027--ACADEMIE DE BILLARD DE BOLLENE"]
[null,"ALLIGIER GERARD","157036R","R1",0.223,"19019--BILLARD CLUB DE LA BAIE"]
[null,"ALVAREZ PHILIPPE","159130S","R1",0.25600000000000001,"19056--BILLARD CLUB DE NICE"]
[null,"AMOUROUX LUC","155531F","R1",0.24199999999999999,"19023--BILLARD CLUB GARDEEN"]
[null,"ANDRY JEAN FRANCOIS","021818E","R1",0.28599999999999998,"19090--BILLARD AMATEUR ROGNAC"]
[null,"ANGIOLINI PIERRE","127654U","N2",0.46400000000000002,"19057--ACADEMIE VENCOISE DE BILLARD"]
[null,"ANGUE PATRICK","021819F","N1",0.69199999999999995,"19056--BILLARD CLUB DE NICE"]
[null,"ANNESTAY JACQUES","021820G","R1",0.27400000000000002,"19025--BILLARD CLUB SISTERONNAIS"]
[null,"ANTONIN ALAIN","021821H","N3",0.33200000000000002,"19021--BILLARD CLUB CAVAILLONNAIS"]
[null,"APREA ARMANDO","021823J","R1",0.3,"19106--BILLARD CLUB VINONNAIS"]
[null,"ARDITI GERALD","021825L","N3",0.38400000000000001,"19056--BILLARD CLUB DE NICE"]
[null,"ARMENGAUD NOEL","021826M","R1",0.24299999999999999,"19009--CLUB BILLARD ISTREEN"]
["NC","ARNOUX LAURENT","180272Y","R2",0.13,"19058 -- ACADEMIE DE BILLARD DE BARBOSSI MANDELIEU"]
[null,"AUBERT ROUECHE ERIC","022383X","N3",0.34399999999999997,"19106--BILLARD CLUB VINONNAIS"]
{"$rows_left_out":367}
{"sheet":"FICHE-JOUEUR","index":3,"n_rows":413,"n_cols":3,"rows_kept":413,"cut":false,"hidden":true,"merged":[[0,0,0,2]]}
["LMB \nFICHE JOUEURS\n"]
["Licence","NOM","PRENOM"]
["106287Z","ABAD","YANNICK"]
["169265J","ABDALLAH","ANTHONY"]
["159403P","ABELA","JOSEPH"]
["169267L","ACOCA","WILLIAM"]
["147622J","ESTABLIER","PIERRE"]
["165301A","BARTH","JEAN PAUL"]
["021810W","AKNIN","GABRIEL"]
["147980Y","AKTAS","JEAN"]
["149448T","ALESSI","JEAN PIERRE"]
["169144C","ALEXANIAN","ANTOINE"]
["151459E","ALIBERT","BRUNO"]
["159130S","ALVAREZ","PHILIPPE"]
["152035F","ALVISET","GUY"]
["155531F","AMOUROUX","LUC"]
["162879S","AMOUROUX","JACQUES ANTOINE"]
["153111A","ANDRIEUX","STEPHANE"]
["021818E","ANDRY","JEAN FRANCOIS"]
["021819F","ANGUE","PATRICK"]
{"$rows_left_out":394}
{"sheet":"Saisie des joueurs","index":4,"n_rows":42,"n_cols":15,"rows_kept":42,"cut":false,"hidden":false,"merged":[[0,2,1,6],[2,2,2,6],[41,2,41,3],[14,10,14,14],[4,4,8,6],[15,2,15,6],[15,10,15,14],[10,3,10,4],[12,2,12,6],[14,2,14,6]]}
[null,null,"LIGUE MEDITERRANEENNE DE BILLARD"]
[null,null,null,null,null,null,null,"Mis à jour le 26/09/2023"]
[null,null,"Saisir ici les informations concernant le tournoi."]
[]
[null,null,"Date  (jj/mm/aa)"]
[]
[null,null,"Nom de la compétition","T1"]
[]
[null,null,"Mode de jeu","3 BANDES"]
[]
[null,null,"Club organisateur",null,null,"Directeur de jeu"]
[]
[null,null,"TOURNOI 2KO A 24 JOUEURS - 4 BILLARDS"]
[]
[null,null,"Dans cet onglet \"Saisir dans la liste déroulante les NOMS  des joueurs de cette Colonne\", l'ordre à saisir n'est pas important :\nMettre JOUEUR \"ABSENT\" sur les cases vides restantes, ensuite cliquer sur le \"BOUTON TRI \"",null,null,null,null,null,null,null,"RESULTAT DU TRI"]
[null,null,"Ne Pas toucher au cellules ci-dessous",null,null,null,null,null,null,null,"Ne Pas toucher au cellules ci-dessous"]
["N°","Liste déroulante NOM ","N° Licence","NOM PRENOM","Catégorie","Moyenne 3,10","Club",null,null,"N°","Licences","NOM PRENOM","Catégorie","Moyenne 3,10","Club"]
[{"$f":"ROW(A1)","v":1},null,{"$f":"IF(B18<>\"\",VLOOKUP(B18,DONNEES!$B$4:$F$414,2,FALSE),\"\")","v":""},{"$f":"IF(B18<>\"\",VLOOKUP(B18,DONNEES!$B$4:$F$414,1,FALSE),\"\")","v":""},{"$f":"IF(B18<>\"\",VLOOKUP(B18,DONNEES!$B$4:$F$414,3,FALSE),\"z\")","v":"z"},{"$f":"IF(B18<>\"\",VLOOKUP(B18,DONNEES!$B$4:$F$414,4,FALSE),\"\")","v":""},{"$f":"IF(B18<>\"\",VLOOKUP(B18,DONNEES!$B$4:$F$414,5,FALSE),\"\")","v":""},null,null,{"$f":"ROW(J1)","v":1},"","","z","",""]
[{"$f":"ROW(A2)","v":2},null,{"$f":"IF(B19<>\"\",VLOOKUP(B19,DONNEES!$B$4:$F$414,2,FALSE),\"\")","v":""},{"$f":"IF(B19<>\"\",VLOOKUP(B19,DONNEES!$B$4:$F$414,1,FALSE),\"\")","v":""},{"$f":"IF(B19<>\"\",VLOOKUP(B19,DONNEES!$B$4:$F$414,3,FALSE),\"z\")","v":"z"},{"$f":"IF(B19<>\"\",VLOOKUP(B19,DONNEES!$B$4:$F$414,4,FALSE),\"\")","v":""},{"$f":"IF(B19<>\"\",VLOOKUP(B19,DONNEES!$B$4:$F$414,5,FALSE),\"\")","v":""},null,null,{"$f":"ROW(J2)","v":2},"","","z","",""]
[3,null,{"$f":"IF(B20<>\"\",VLOOKUP(B20,DONNEES!$B$4:$F$414,2,FALSE),\"\")","v":""},{"$f":"IF(B20<>\"\",VLOOKUP(B20,DONNEES!$B$4:$F$414,1,FALSE),\"\")","v":""},{"$f":"IF(B20<>\"\",VLOOKUP(B20,DONNEES!$B$4:$F$414,3,FALSE),\"z\")","v":"z"},{"$f":"IF(B20<>\"\",VLOOKUP(B20,DONNEES!$B$4:$F$414,4,FALSE),\"\")","v":""},{"$f":"IF(B20<>\"\",VLOOKUP(B20,DONNEES!$B$4:$F$414,5,FALSE),\"\")","v":""},null,null,3,"","","z","",""]
{"$rows_left_out":23}
{"sheet":"GRAPHIQUE 24J","index":5,"n_rows":50,"n_cols":99,"rows_kept":50,"cut":false,"hidden":false,"merged":[[46,26,46,35],[35,80,36,80],[34,23,35,23],[34,40,35,40],[49,26,49,35],[39,70,40,70],[43,26,44,35],[25,3,25,5],[33,3,33,5],[41,3,41,5],[47,26,47,35],[31,4,32,4],[39,4,40,4],[39,19,40,19],[31,19,32,19],[48,26,48,35],[47,1,50,12],[43,1,43,3],[43,5,43,8],[43,16,49,25],[43,40,44,43],[41,53,41,55],[39,54,40,54],[45,26,45,35],[34,77,35,77],[34,60,35,60],[26,60,27,60],[27,26,28,26],[29,62,29,64],[27,63,28,63],[29,25,29,27],[29,42,29,44],[33,41,33,44],[33,35,33,37],[33,69,33,71],[30,67,31,67],[31,70,32,70],[29,33,29,37],[31,36,32,36],[35,26,36,26],[35,43,36,43],[35,63,36,63],[26,8,27,8],[34,8,35,8],[10,8,11,8],[9,41,9,44],[11,26,12,26],[6,40,6,44],[10,40,11,40],[43,10,43,12],[41,69,41,71],[37,33,37,37],[39,36,40,36],[37,67,37,71],[38,67,39,67],[37,51,37,55],[37,16,37,20],[14,16,15,16],[13,33,13,37],[13,10,13,12],[19,26,20,26],[18,23,19,23],[15,36,16,36],[14,33,15,33],[17,35,17,37],[15,54,16,54],[35,11,36,11],[23,19,24,19],[41,18,41,20],[41,35,41,37],[26,23,27,23],[1,1,2,55],[1,60,2,97],[25,69,25,71],[19,63,20,63],[19,80,20,80],[15,96,16,96],[18,77,19,77],[14,93,15,93],[13,2,13,5],[9,9,9,12],[13,16,13,20],[13,67,13,71],[10,93,11,97],[13,93,13,97],[13,85,13,89],[6,51,6,55],[6,60,6,64],[18,8,19,8],[9,61,9,64],[4,77,4,81],[4,85,4,89],[4,67,4,71],[4,60,4,64],[25,53,25,55],[4,1,4,20],[15,4,16,4],[6,1,6,5],[6,8,6,12],[6,16,6,20],[11,11,12,11],[15,88,16,88],[14,85,15,85],[11,80,12,80],[10,77,11,77],[10,60,11,60],[9,24,9,27],[13,79,13,81],[13,62,13,64],[13,42,13,44],[9,77,9,81],[14,1,15,1],[17,24,17,27],[17,41,17,44],[6,93,6,97],[6,33,6,37],[10,23,11,23],[11,63,12,63],[4,23,4,37],[4,40,4,55],[13,25,13,27],[21,79,21,81],[17,77,17,81],[18,60,19,60],[17,69,17,71],[13,51,13,55],[17,87,17,89],[21,62,21,64],[6,23,6,27],[11,43,12,43],[6,67,6,71],[6,77,6,81],[6,85,6,89],[17,95,17,97],[17,61,17,64],[14,67,15,67],[15,70,16,70],[14,51,15,51],[17,18,17,20],[15,19,16,19],[21,10,21,12],[21,25,21,27],[17,53,17,55],[21,33,21,37],[18,1,19,2],[17,3,17,5],[19,3,19,5],[19,43,20,43],[23,4,24,4],[44,77,45,80],[17,9,17,12],[25,9,25,12],[33,9,33,12],[33,77,33,81],[21,67,21,71],[18,40,19,40],[29,79,29,81],[19,11,20,11],[21,16,21,20],[29,51,29,55],[33,61,33,64],[37,10,37,12],[37,25,37,27],[37,42,37,44],[37,62,37,64],[27,11,28,11],[37,79,37,81],[29,10,29,12],[25,24,25,27],[33,24,33,27],[25,41,25,44],[29,16,29,20],[25,18,25,20],[33,18,33,20],[26,93,27,97],[29,93,29,97],[29,85,29,89],[33,95,33,97],[31,88,32,88],[31,54,32,54],[33,53,33,55],[29,67,29,71],[25,77,25,81],[26,77,27,77],[26,40,27,40],[27,43,28,43],[27,80,28,80],[25,61,25,64],[25,35,25,37],[23,70,24,70],[22,67,23,67],[23,36,24,36],[31,96,32,96],[30,85,31,85],[30,93,31,93],[21,42,21,44],[21,51,21,55],[33,87,33,89],[23,54,24,54]]}
[]
[null,"SAMEDI",null,null,null,null,null,null,null,null,null,null,null,null,null,null,null,null,null,null,null,null,null,null,null,null,null,null,null,null,null,null,null,null,null,null,null,null,null,null,null,null,null,null,null,null,null,null,null,null,null,null,null,null,null,null,null,null,null,null,"DIMANCHE"]
[]
[]
[null,"PHASE 1  DISTANCES 1",null,null,null,null,null,null,null,null,null,null,null,null,null,null,null,null,null,null,null,null,null,"PHASE 2  DISTANCES 1",null,null,null,null,null,null,null,null,null,null,null,null,null,null,null,null,"PHASE 3  DISTANCES 1",null,null,null,null,null,null,null,null,null,null,null,null,null,null,null,null,null,null,null,"PHASE 4  DISTANCES 1",null,null,null,null,null,null,"PHASE 4  DISTANCES 1",null,null,null,null,null,null,null,null,null,"PHASE 5  DISTANCES 2",null,null,null,null,null,null,null,"PHASE 6  DISTANCES 2"]
[]
[null,"TOUR 1",null,null,null,null,null,null,"TOUR 2",null,null,null,null,null,null,null,"TOUR 3",null,null,null,null,null,null,"TOUR 4",null,null,null,null,null,null,null,null,null,"TOUR 5",null,null,null,null,null,null,"TOUR 6",null,null,null,null,null,null,null,null,null,null,"TOUR 7",null,null,null,null,null,null,null,null,"TOUR 8",null,null,null,null,null,null,"TOUR 9",null,null,null,null,null,null,null,null,null,"TOUR 10",null,null,null,null,null,null,null,"TOUR 11",null,null,null,null,null,null,null,"TOUR 12"]
[]
[]
[null,null,null,null,null,null,null,null,"J 16","ELIMINATOIRE 1",null,null,null,null,null,null,null,null,null,null,null,null,null,"J 9","ELIMINATOIRE 2",null,null,null,null,null,null,null,null,null,null,null,null,null,null,null,"J 8","ELIMINATOIRE 3",null,null,null,null,null,null,null,null,null,null,null,null,null,null,null,null,null,null,"J 3","ELIMINATOIRE 4",null,null,null,null,null,null,null,null,null,null,null,null,null,null,null,"1/4 DE FINALE"]
[null,null,null,null,null,null,null,null,"Match 5","JOUEUR","Pts","Rep","Ser",null,null,null,null,null,null,null,null,null,null,"Match 13","JOUEUR","Pts","Rep","Ser",null,null,null,null,null,null,null,null,null,null,null,null,"Match 21","JOUEUR","Pts","Rep","Ser",null,null,null,null,null,null,null,null,null,null,null,null,null,null,null,"Match 29","JOUEUR","Pts","Rep","Ser",null,null,null,null,null,null,null,null,null,null,null,null,"Match 37","JOUEUR","Pts","Rep","Ser",null,null,null,null,null,null,null,null,null,null,null,"PHASE 7  DISTANCES 2"]
[null,null,null,null,null,null,null,null,null,{"$f":"'Saisie des joueurs'!L33","v":""},null,null,null,{"$f":"IF(K12>K13,2,0)","v":0},null,null,null,null,null,null,null,null,null,null,{"$f":"'Saisie des joueurs'!L26","v":""},null,null,null,{"$f":"IF(Z12>Z13,2,0)","v":0},null,null,null,null,null,null,null,null,null,null,null,null,{"$f":"'Saisie des joueurs'!L25","v":""},null,null,null,{"$f":"IF(AQ12>AQ13,2,0)","v":0},null,null,null,null,null,null,null,null,null,null,null,null,null,null,null,{"$f":"'Saisie des joueurs'!L20","v":""},null,null,null,{"$f":"IF(BK12>BK13,2,0)","v":0},null,null,null,null,null,null,null,null,null,null,null,null,{"$f":"IF(BK12=BK13,\"\",IF(BK12>BK13,BJ12,BJ13))","v":""},null,null,null,{"$f":"IF(CB12>CB13,2,0)","v":0}]
[null,null,null,null,null,null,null,null,"Format Billard",{"$f":"IF(D16=D17,\"\",IF(D16>D17,C16,C17))","v":""},null,null,null,{"$f":"IF(K13>K12,2,0)","v":0},null,null,null,null,null,null,null,null,null,"Format Billard",{"$f":"IF(K12=K13,\"\",IF(K12>K13,J12,J13))","v":""},null,null,null,{"$f":"IF(Z13>Z12,2,0)","v":0},null,null,null,null,null,null,null,null,null,null,null,"Format Billard",{"$f":"IF(Z12=Z13,\"\",IF(Z12>Z13,Y12,Y13))","v":""},null,null,null,{"$f":"IF(AQ13>AQ12,2,0)","v":0},null,null,null,null,null,null,null,null,null,null,null,null,null,null,"Format Billard",{"$f":"IF(AQ12=AQ13,\"\",IF(AQ12>AQ13,AP12,AP13))","v":""},null,null,null,{"$f":"IF(BK13>BK12,2,0)","v":0},null,null,null,null,null,null,null,null,null,null,null,"Format Billard",{"$f":"IF(BR32=BR33,\"\",IF(BR32>BR33,BQ32,BQ33))","v":""},null,null,null,{"$f":"IF(CB13>CB12,2,0)","v":0}]
[null,"J 24","ELIMINATOIRE 1",null,null,null,null,null,null,null,{"$f":"IF(D16=D17,\"\",IF(D16<D17,C16,C17))","v":""},null,null,null,null,null,"ELIMINATOIRE 1",null,null,null,null,null,null,null,null,{"$f":"IF(S16=S17,\"\",IF(S16<S17,R16,R17))","v":""},null,null,null,null,null,null,null,"ELIMINATOIRE 2",null,null,null,null,null,null,null,null,{"$f":"IF(AJ16=AJ17,\"\",IF(AJ16<AJ17,AI16,AI17))","v":""},null,null,null,null,null,null,null,null,"ELIMINATOIRE 3",null,null,null,null,null,null,null,null,null,null,{"$f":"IF(BB16>BB17,BA16,BA17)","v":""},null,null,null,null,"REPÊCHAGE",null,null,null,null,null,null,null,null,null,null,null,{"$f":"IF(BR16=BR17,\"\",IF(BR16<BR17,BQ16,BQ17))","v":""},null,null,null,null,null,"1/2 FINALE",null,null,null,null,null,null,null,"3éme et 4éme PLACES"]
[null,"Match 1","JOUEUR","Pts","Rep","Ser",null,null,null,null,null,null,null,null,null,null,"Match 9","JOUEUR","Pts","Rep","Ser",null,null,null,null,null,null,null,null,null,null,null,null,"Match 17","JOUEUR","Pts","Rep","Ser",null,null,null,null,null,null,null,null,null,null,null,null,null,"Match 25","JOUEUR","Pts","Rep","Ser",null,null,null,null,null,null,null,null,null,null,null,"Match 33","JOUEUR","Pts","Rep","Ser",null,null,null,null,null,null,null,null,null,null,null,null,null,"Match 41","JOUEUR","Pts","Rep","Ser",null,null,null,"Match 43","JOUEUR","Pts","Rep","Ser"]
[null,null,{"$f":"'Saisie des joueurs'!L41","v":""},null,null,null,{"$f":"IF(D16>D17,2,0)","v":0},null,null,null,null,null,null,null,null,null,null,{"$f":"IF(D16=D17,\"\",IF(D16<D17,C16,C17))","v":""},null,null,null,{"$f":"IF(S16>S17,2,0)","v":0},null,null,null,null,null,null,null,null,null,null,null,null,{"$f":"IF(S16=S17,\"\",IF(S16>S17,R16,R17))","v":""},null,null,null,{"$f":"IF(AJ16>AJ17,2,0)","v":0},null,null,null,null,null,null,null,null,null,null,null,null,null,{"$f":"IF(AJ16=AJ17,\"\",IF(AJ16>AJ17,AI16,AI17))","v":""},null,null,null,{"$f":"IF(BB16>BB17,2,0)","v":0},null,null,null,null,null,null,null,null,null,null,null,{"$f":"IF(BB16=BB17,\"\",IF(BB16>BB17,BA16,BA17))","v":""},null,null,null,{"$f":"IF(BR16>BR17,2,0)","v":0},null,null,null,null,null,null,null,null,null,null,null,null,null,{"$f":"IF(CB12=CB13,\"\",IF(CB12>CB13,CA12,CA13))","v":""},null,null,null,{"$f":"IF(CJ16>CJ17,2,0)","v":0},null,null,null,{"$f":"IF(CJ16=CJ17,\"\",IF(CJ16<CJ17,CI16,CI17))","v":""},null,null,null,{"$f":"IF(CR16>CR17,2,0)","v":0}]
[null,"Format Billard",{"$f":"'Saisie des joueurs'!L34","v":""},null,null,null,{"$f":"IF(D17>D16,2,0)","v":0},null,null,null,null,null,null,null,null,null,"Format Billard",{"$f":"IF(K20=K21,\"\",IF(K20<K21,J20,J21))","v":""},null,null,null,{"$f":"IF(S17>S16,2,0)","v":0},null,null,null,null,null,null,null,null,null,null,null,"Format Billard",{"$f":"IF(Z36=Z37,\"\",IF(Z36<Z37,Y36,Y37))","v":""},null,null,null,{"$f":"IF(AJ17>AJ16,2,0)","v":0},null,null,null,null,null,null,null,null,null,null,null,null,"Format Billard",{"$f":"IF(AQ28=AQ29,\"\",IF(AQ28<AQ29,AP28,AP29))","v":""},null,null,null,{"$f":"IF(BB17>BB16,2,0)","v":0},null,null,null,null,null,null,null,null,null,null,"Format Billard",{"$f":"IF(BK12=BK13,\"\",IF(BK12<BK13,BJ12,BJ13))","v":""},null,null,null,{"$f":"IF(BR17>BR16,2,0)","v":0},null,null,null,null,null,null,null,null,null,null,null,null,"Format Billard",{"$f":"IF(CB20=CB21,\"\",IF(CB20>CB21,CA20,CA21))","v":""},null,null,null,{"$f":"IF(CJ17>CJ16,2,0)","v":0},null,null,"Format Billard",{"$f":"IF(CJ32=CJ33,\"\",IF(CJ32<CJ33,CI32,CI33))","v":""},null,null,null,{"$f":"IF(CR17>CR16,2,0)","v":0}]
[null,null,"J 17",{"$f":"J12","v":""},null,null,null,null,"J 15","ELIMINATOIRE 1",null,null,null,null,null,null,null,null,{"$f":"Y12","v":""},null,null,null,null,"J 10","ELIMINATOIRE 2",null,null,null,null,null,null,null,null,null,null,{"$f":"AP12","v":""},null,null,null,null,"J 7","ELIMINATOIRE 3",null,null,null,null,null,null,null,null,null,null,null,{"$f":"IF(AQ12=AQ13,\"\",IF(AQ12>AQ13,AP12,AP13))","v":""},null,null,null,null,null,null,"J 2","ELIMINATOIRE 4",null,null,null,null,null,null,null,{"$f":"IF(BK12=BK13,\"\",IF(BK12>BK13,BJ12,BJ13))","v":""},null,null,null,null,null,null,null,"1/4 DE FINALE",null,null,null,null,null,null,null,null,null,{"$f":"IF(CB12=CB13,\"\",IF(CB12<CB13,CA12,CA13))","v":""},null,null,null,null,null,null,null,{"$f":"IF(CB36=CB37,\"\",IF(CB36<CB37,CA36,CA37))","v":""}]
[null,"Format de Billard : mettre 3,10\nsi match joué sur ces billards",null,null,null,null,null,null,"Match 6","JOUEUR","Pts","Rep","Ser",null,null,null,null,null,null,null,null,null,null,"Match 14","JOUEUR","Pts","Rep","Ser",null,null,null,null,null,null,null,null,null,null,null,null,"Match 22","JOUEUR","Pts","Rep","Ser",null,null,null,null,null,null,null,null,null,null,null,null,null,null,null,"Match 30","JOUEUR","Pts","Rep","Ser",null,null,null,null,null,null,null,null,null,null,null,null,"Match 38","JOUEUR","Pts","Rep","Ser"]
[null,null,null,"Arbitre",null,null,null,null,null,{"$f":"'Saisie des joueurs'!L32","v":""},null,null,null,{"$f":"IF(K20>K21,2,0)","v":0},null,null,null,null,null,null,null,null,null,null,{"$f":"'Saisie des joueurs'!L27","v":""},null,null,null,{"$f":"IF(Z20>Z21,2,0)","v":0},null,null,null,null,null,null,null,null,null,null,null,null,{"$f":"'Saisie des joueurs'!L24","v":""},null,null,null,{"$f":"IF(AQ20>AQ21,2,0)","v":0},null,null,null,null,null,null,null,null,null,null,null,null,null,null,null,{"$f":"'Saisie des joueurs'!L19","v":""},null,null,null,{"$f":"IF(BK20>BK21,2,0)","v":0},null,null,null,null,null,null,null,null,null,null,null,null,{"$f":"IF(BK20=BK21,\"\",IF(BK20>BK21,BJ20,BJ21))","v":""},null,null,null,{"$f":"IF(CB20>CB21,2,0)","v":0}]
{"$rows_left_out":31}
{"sheet":"Distances","index":6,"n_rows":24,"n_cols":7,"rows_kept":24,"cut":false,"hidden":false,"merged":[[4,1,10,3],[12,1,18,3],[23,1,23,2],[0,1,0,5],[1,1,1,5],[2,1,2,5]]}
[null,"ANNEXE 1 au RS Carambole 2023-2024"]
[null,"LIGUE MEDITERANNEE BILLARD"]
[null,"Catégories et Distances"]
[]
[null,"DISTANCES 1\n3 BANDES 2KO\nPhases jusqu'aux\nrepêchages",null,null,"N 1","30 Pts / 50 r"]
[null,null,null,null,"N 2","25 Pts / 50 r"]
[]
[null,null,null,null,null,"2,80 m","3,10 m"]
[null,null,null,null,"N 3","15 Pts / 40 r","12 Pts / 40 r"]
[null,null,null,null,"R 1","12 Pts / 40 r","10 Pts / 40 r"]
[null,null,null,null,"R 2","8 Pts / 40 r"]
[]
[null,"DISTANCES 2\n3 BANDES 2KO\nPhases finales",null,null,"N 1","35 Pts / 50 r"]
[null,null,null,null,"N 2","30 Pts / 50 r"]
[]
[null,null,null,null,null,"2,80 m","3,10 m"]
[null,null,null,null,"N 3","20 Pts / 40 r","15 Pts / 40 r"]
[null,null,null,null,"R 1","15 Pts / 40 r","13 Pts / 40 r"]
[null,null,null,null,"R 2","11 Pts / 40 r"]
[]
{"$rows_left_out":5}
{"sheet":"Heures convocations","index":7,"n_rows":40,"n_cols":9,"rows_kept":40,"cut":false,"hidden":false,"merged":[[31,2,32,2],[5,3,5,5],[0,0,0,6],[3,0,3,4],[7,0,7,6],[10,3,10,6],[11,1,12,1],[11,2,12,2],[26,2,27,2],[11,0,25,0],[26,0,36,0],[26,1,27,1]]}
["LIGUE MEDITERRANEENNE DE BILLARD"]
[]
[]
["TOURNOI HOMOLOGUE",null,null,null,null,{"$f":"'Saisie des joueurs'!D7","v":"T1"},{"$f":"'Saisie des joueurs'!D9","v":"3 BANDES"}]
[]
[null,null,null,{"$f":"'Saisie des joueurs'!D11:D11","v":0},null,null,{"$f":"'Saisie des joueurs'!D5","v":"00:00:00"},null," "]
[]
["HORAIRES DES CONVOCATIONS JOUEURS ET ARBITRES"]
[]
[]
["JOUR","N° TOUR HORAIRE ","HEURE CONVOC","NOMS"]
["SAMEDI",1,"8 H 30",{"$f":"'GRAPHIQUE 24J'!C16","v":""},{"$f":"'GRAPHIQUE 24J'!C24","v":""},{"$f":"'GRAPHIQUE 24J'!C32","v":""},{"$f":"'GRAPHIQUE 24J'!C40","v":""}]
[null,null,null,{"$f":"'GRAPHIQUE 24J'!C17","v":""},{"$f":"'GRAPHIQUE 24J'!C25","v":""},{"$f":"'GRAPHIQUE 24J'!C33","v":""},{"$f":"'GRAPHIQUE 24J'!C41","v":""}]
[null,"09 H 00","8 H 45",{"$f":"'GRAPHIQUE 24J'!J12","v":""},{"$f":"'GRAPHIQUE 24J'!J20","v":""},{"$f":"'GRAPHIQUE 24J'!J28","v":""},{"$f":"'GRAPHIQUE 24J'!J36","v":""}]
[null,2]
[null,"10 H 15"]
[null,3,"11 H 15",{"$f":"'GRAPHIQUE 24J'!Y12","v":""},{"$f":"'GRAPHIQUE 24J'!Y20","v":""},{"$f":"'GRAPHIQUE 24J'!Y28","v":""},{"$f":"'GRAPHIQUE 24J'!Y36","v":""}]
[null,"11 H 30"]
[null,4]
[null,"13 H 00"]
{"$rows_left_out":20}